{"text_format":"1","workbook":"xlsx","n_sheets":11,"sheets":["AÇIKLAMA","BİLGİ GİRİŞİ","1","2","3","4","5","6","7","8","KAPAK"],"not_rendered":{"charts":0,"images":5,"macros":1,"external_links":0,"defined_names":9,"comments":0,"pivot_tables":0},"unopened":[],"bounds":{"document_bytes":16777216,"sheet_cells":100000,"rows_first":2000,"rows_last":500,"rows_between":2000,"halvings":0,"cell_chars":16384,"cell_head_chars":4096},"cells_cut":0,"cells_raw":0,"read":"whole","date_system":"1900"}

{"sheet":"AÇIKLAMA","index":0,"n_rows":0,"n_cols":0,"rows_kept":0,"cut":false,"hidden":false,"merged":[]}

{"sheet":"BİLGİ GİRİŞİ","index":1,"n_rows":202,"n_cols":67,"rows_kept":202,"cut":false,"hidden":false,"merged":[[153,47,153,50],[154,4,154,18],[154,19,154,21],[154,22,154,24],[154,25,154,26],[154,27,154,30],[154,31,154,34],[154,35,154,38],[154,39,154,42],[154,43,154,46],[154,47,154,50],[153,4,153,18],[153,19,153,21],[153,22,153,24],[153,25,153,26],[153,27,153,30],[153,31,153,34],[153,35,153,38],[153,39,153,42],[153,43,153,46],[151,47,151,50],[152,4,152,18],[152,19,152,21],[152,22,152,24],[152,25,152,26],[152,27,152,30],[152,31,152,34],[152,35,152,38],[152,39,152,42],[152,43,152,46],[152,47,152,50],[151,4,151,18],[151,19,151,21],[151,22,151,24],[151,25,151,26],[151,27,151,30],[151,31,151,34],[151,35,151,38],[151,39,151,42],[151,43,151,46],[149,47,149,50],[150,4,150,18],[150,19,150,21],[150,22,150,24],[150,25,150,26],[150,27,150,30],[150,31,150,34],[150,35,150,38],[150,39,150,42],[150,43,150,46],[150,47,150,50],[149,4,149,18],[149,19,149,21],[149,22,149,24],[149,25,149,26],[149,27,149,30],[149,31,149,34],[149,35,149,38],[149,39,149,42],[149,43,149,46],[147,47,147,50],[148,4,148,18],[148,19,148,21],[148,22,148,24],[148,25,148,26],[148,27,148,30],[148,31,148,34],[148,35,148,38],[148,39,148,42],[148,43,148,46],[148,47,148,50],[147,4,147,18],[147,19,147,21],[147,22,147,24],[147,25,147,26],[147,27,147,30],[147,31,147,34],[147,35,147,38],[147,39,147,42],[147,43,147,46],[145,47,145,50],[146,4,146,18],[146,19,146,21],[146,22,146,24],[146,25,146,26],[146,27,146,30],[146,31,146,34],[146,35,146,38],[146,39,146,42],[146,43,146,46],[146,47,146,50],[145,4,145,18],[145,19,145,21],[145,22,145,24],[145,25,145,26],[145,27,145,30],[145,31,145,34],[145,35,145,38],[145,39,145,42],[145,43,145,46],[144,4,144,18],[144,19,144,21],[144,22,144,24],[144,25,144,26],[144,27,144,30],[144,31,144,34],[144,35,144,38],[144,39,144,42],[144,43,144,46],[144,47,144,50],[143,4,143,18],[143,19,143,21],[143,22,143,24],[143,25,143,26],[143,27,143,30],[143,31,143,34],[143,35,143,38],[143,39,143,42],[143,43,143,46],[142,4,142,18],[142,19,142,21],[142,22,142,24],[142,25,142,26],[142,27,142,30],[142,31,142,34],[142,35,142,38],[142,39,142,42],[142,43,142,46],[142,47,142,50],[141,4,141,18],[141,19,141,21],[141,22,141,24],[141,25,141,26],[141,27,141,30],[141,31,141,34],[141,35,141,38],[141,39,141,42],[141,43,141,46],[140,4,140,18],[140,19,140,21],[140,22,140,24],[140,25,140,26],[140,27,140,30],[140,31,140,34],[140,35,140,38],[140,39,140,42],[140,43,140,46],[140,47,140,50],[139,4,139,18],[139,19,139,21],[139,22,139,24],[139,25,139,26],[139,27,139,30],[139,31,139,34],[139,35,139,38],[139,39,139,42],[139,43,139,46],[136,27,136,30],[136,31,136,34],[136,35,136,38],[136,39,136,42],[136,43,136,46],[136,47,136,50],[135,4,135,18],[135,19,135,21],[135,22,135,24],[135,25,135,26],[135,27,135,30],[135,31,135,34],[135,35,135,38],[135,39,135,42],[135,43,135,46],[137,47,137,50],[138,4,138,18],[138,19,138,21],[138,22,138,24],[138,25,138,26],[138,27,138,30],[138,31,138,34],[138,35,138,38],[138,39,138,42],[138,43,138,46],[138,47,138,50],[137,4,137,18],[137,19,137,21],[137,22,137,24],[137,25,137,26],[137,27,137,30],[137,31,137,34],[86,47,86,50],[87,4,87,18],[87,19,87,21],[87,22,87,24],[87,25,87,26],[87,27,87,30],[87,31,87,34],[87,35,87,38],[87,39,87,42],[87,43,87,46],[87,47,87,50],[86,4,86,18],[86,19,86,21],[86,22,86,24],[86,25,86,26],[86,27,86,30],[86,31,86,34],[86,35,86,38],[86,39,86,42],[86,43,86,46],[84,47,84,50],[85,4,85,18],[85,19,85,21],[85,22,85,24],[85,25,85,26],[85,27,85,30],[85,31,85,34],[85,35,85,38],[85,39,85,42],[85,43,85,46],[85,47,85,50],[84,4,84,18],[84,19,84,21],[84,22,84,24],[84,25,84,26],[84,27,84,30],[84,31,84,34],[84,35,84,38],[84,39,84,42],[84,43,84,46],[82,47,82,50],[83,4,83,18],[83,19,83,21],[83,22,83,24],[83,25,83,26],[83,27,83,30],[83,31,83,34],[83,35,83,38],[83,39,83,42],[83,43,83,46],[83,47,83,50],[82,4,82,18],[82,19,82,21],[82,22,82,24],[82,25,82,26],[82,27,82,30],[82,31,82,34],[82,35,82,38],[82,39,82,42],[82,43,82,46],[80,47,80,50],[81,4,81,18],[81,19,81,21],[81,22,81,24],[81,25,81,26],[81,27,81,30],[81,31,81,34],[81,35,81,38],[81,39,81,42],[81,43,81,46],[81,47,81,50],[80,4,80,18],[80,19,80,21],[80,22,80,24],[80,25,80,26],[80,27,80,30],[80,31,80,34],[80,35,80,38],[80,39,80,42],[80,43,80,46],[78,47,78,50],[79,4,79,18],[79,19,79,21],[79,22,79,24],[79,25,79,26],[79,27,79,30],[79,31,79,34],[79,35,79,38],[79,39,79,42],[79,43,79,46],[79,47,79,50],[78,4,78,18],[78,19,78,21],[78,22,78,24],[78,25,78,26],[78,27,78,30],[78,31,78,34],[78,35,78,38],[78,39,78,42],[78,43,78,46],[76,47,76,50],[77,4,77,18],[77,19,77,21],[77,22,77,24],[77,25,77,26],[77,27,77,30],[77,31,77,34],[77,35,77,38],[77,39,77,42],[77,43,77,46],[77,47,77,50],[76,4,76,18],[76,19,76,21],[76,22,76,24],[76,25,76,26],[76,27,76,30],[76,31,76,34],[76,35,76,38],[76,39,76,42],[76,43,76,46],[74,47,74,50],[75,4,75,18],[75,19,75,21],[75,22,75,24],[75,25,75,26],[75,27,75,30],[75,31,75,34],[75,35,75,38],[75,39,75,42],[75,43,75,46],[75,47,75,50],[74,4,74,18],[74,19,74,21],[74,22,74,24],[74,25,74,26],[74,27,74,30],[74,31,74,34],[74,35,74,38],[74,39,74,42],[74,43,74,46],[71,47,71,50],[70,4,70,18],[70,19,70,21],[70,22,70,24],[70,25,70,26],[70,27,70,30],[70,31,70,34],[70,35,70,38],[70,39,70,42],[70,43,70,46],[72,47,72,50],[73,4,73,18],[73,19,73,21],[73,22,73,24],[73,25,73,26],[73,27,73,30],[73,31,73,34],[73,35,73,38],[73,39,73,42],[73,43,73,46],[73,47,73,50],[72,4,72,18],[72,19,72,21],[72,22,72,24],[72,25,72,26],[72,27,72,30],[72,31,72,34],[72,35,72,38],[72,39,72,42],[72,43,72,46],[186,4,186,50],[187,4,187,50],[188,4,188,50],[189,4,189,50],[165,4,165,50],[166,4,166,50],[167,4,167,50],[69,27,69,30],[69,31,69,34],[69,35,69,38],[69,39,69,42],[69,43,69,46],[69,47,69,50],[68,4,68,18],[68,19,68,21],[68,22,68,24],[68,25,68,26],[68,27,68,30],[68,31,68,34],[68,35,68,38],[68,39,68,42],[68,43,68,46],[70,47,70,50],[71,4,71,18],[71,19,71,21],[71,22,71,24],[71,25,71,26],[71,27,71,30],[71,31,71,34],[71,35,71,38],[71,39,71,42],[71,43,71,46],[116,39,116,42],[116,43,116,46],[116,47,116,50],[117,27,117,30],[164,3,164,50],[162,21,162,50],[162,3,162,19],[19,69,20,71],[21,69,29,71],[197,4,197,50],[198,4,198,50],[199,4,199,50],[200,4,200,50],[201,4,201,50],[173,4,173,50],[176,4,176,50],[177,4,177,50],[178,4,178,50],[179,4,179,50],[175,4,175,50],[174,4,174,50],[190,4,190,50],[191,4,191,50],[192,4,192,50],[193,4,193,50],[194,4,194,50],[195,4,195,50],[196,4,196,50],[182,4,182,50],[183,4,183,50],[184,4,184,50],[185,4,185,50],[135,47,135,50],[137,35,137,38],[137,39,137,42],[137,43,137,46],[139,47,139,50],[141,47,141,50],[143,47,143,50],[168,4,168,50],[169,4,169,50],[170,4,170,50],[171,4,171,50],[172,4,172,50],[114,47,114,50],[155,47,155,50],[155,4,155,18],[155,19,155,21],[155,22,155,24],[155,25,155,26],[155,27,155,30],[155,31,155,34],[155,35,155,38],[155,39,155,42],[155,43,155,46],[115,27,115,30],[115,31,115,34],[115,35,115,38],[115,39,115,42],[115,43,115,46],[115,47,115,50],[116,27,116,30],[116,31,116,34],[116,35,116,38],[89,35,89,38],[89,27,89,30],[68,47,68,50],[69,4,69,18],[69,19,69,21],[69,22,69,24],[69,25,69,26],[94,60,94,62],[94,57,94,59],[94,54,94,56],[159,31,159,34],[160,31,160,34],[159,35,159,38],[160,35,160,38],[159,39,159,42],[160,39,160,42],[159,47,159,50],[160,47,160,50],[159,43,159,46],[160,43,160,46],[96,35,96,38],[96,39,96,42],[96,43,96,46],[96,47,96,50],[110,39,110,42],[110,43,110,46],[110,47,110,50],[156,43,156,46],[156,47,156,50],[114,43,114,46],[99,31,99,34],[99,35,99,38],[95,47,95,50],[104,27,104,30],[109,47,109,50],[109,39,109,42],[109,43,109,46],[98,31,98,34],[98,35,98,38],[98,39,98,42],[98,43,98,46],[102,47,102,50],[103,47,103,50],[104,47,104,50],[105,47,105,50],[106,47,106,50],[101,39,101,42],[104,4,104,18],[101,25,101,26],[106,22,106,24],[106,25,106,26],[99,22,99,24],[99,25,99,26],[98,22,98,24],[109,22,109,24],[96,4,96,18],[96,27,96,30],[96,31,96,34],[95,39,95,42],[108,25,108,26],[108,27,108,30],[108,31,108,34],[108,35,108,38],[108,39,108,42],[110,25,110,26],[96,25,96,26],[97,25,97,26],[41,43,41,46],[41,47,41,50],[42,47,42,50],[43,47,43,50],[44,47,44,50],[45,47,45,50],[97,43,97,46],[97,31,97,34],[97,35,97,38],[99,39,99,42],[99,43,99,46],[99,47,99,50],[104,19,104,21],[104,22,104,24],[104,25,104,26],[106,31,106,34],[106,35,106,38],[110,35,110,38],[91,27,92,50],[91,3,92,26],[106,39,106,42],[94,22,95,24],[94,19,95,21],[94,35,94,42],[95,27,95,30],[94,25,95,26],[94,27,94,34],[95,31,95,34],[95,35,95,38],[89,47,89,50],[94,43,94,50],[98,25,98,26],[88,4,88,18],[88,19,88,21],[88,22,88,24],[88,25,88,26],[88,27,88,30],[88,31,88,34],[88,35,88,38],[88,39,88,42],[37,43,37,46],[37,47,37,50],[95,43,95,46],[46,47,46,50],[47,47,47,50],[39,35,39,38],[39,39,39,42],[40,27,40,30],[40,31,40,34],[98,47,98,50],[97,39,97,42],[88,47,88,50],[41,35,41,38],[41,39,41,42],[96,19,96,21],[97,19,97,21],[89,39,89,42],[97,27,97,30],[96,22,96,24],[97,22,97,24],[98,19,98,21],[40,43,40,46],[35,43,35,46],[36,27,36,30],[36,31,36,34],[36,35,36,38],[36,43,36,46],[35,31,35,34],[32,43,32,46],[32,47,32,50],[33,27,33,30],[33,31,33,34],[33,35,33,38],[33,39,33,42],[32,27,32,30],[32,31,32,34],[32,35,32,38],[37,35,37,38],[37,39,37,42],[39,43,39,46],[39,47,39,50],[37,27,37,30],[37,31,37,34],[35,35,35,38],[35,39,35,42],[28,47,28,50],[28,31,28,34],[27,27,27,34],[27,35,27,42],[29,31,29,34],[28,27,28,30],[29,27,29,30],[34,31,34,34],[34,35,34,38],[34,39,34,42],[39,27,39,30],[39,31,39,34],[34,27,34,30],[30,22,30,24],[31,22,31,24],[97,47,97,50],[30,47,30,50],[31,27,31,30],[31,31,31,34],[31,35,31,38],[31,39,31,42],[30,27,30,30],[30,31,30,34],[30,35,30,38],[30,39,30,42],[30,43,30,46],[31,43,31,46],[31,47,31,50],[36,39,36,42],[36,47,36,50],[40,35,40,38],[40,39,40,42],[108,43,108,46],[108,47,108,50],[107,4,107,18],[107,19,107,21],[107,22,107,24],[107,25,107,26],[107,27,107,30],[107,31,107,34],[107,35,107,38],[107,39,107,42],[100,43,100,46],[100,47,100,50],[106,43,106,46],[107,43,107,46],[106,27,106,30],[103,4,103,18],[103,19,103,21],[103,22,103,24],[103,25,103,26],[103,27,103,30],[103,31,103,34],[103,35,103,38],[103,39,103,42],[103,43,103,46],[100,39,100,42],[105,31,105,34],[105,35,105,38],[105,39,105,42],[105,43,105,46],[111,22,111,24],[112,22,112,24],[111,25,111,26],[112,25,112,26],[105,4,105,18],[105,19,105,21],[108,22,108,24],[101,43,101,46],[101,47,101,50],[109,25,109,26],[101,19,101,21],[101,22,101,24],[101,27,101,30],[101,31,101,34],[101,35,101,38],[102,4,102,18],[102,19,102,21],[102,22,102,24],[102,25,102,26],[102,27,102,30],[102,31,102,34],[102,35,102,38],[110,27,110,30],[110,31,110,34],[110,4,110,18],[110,22,110,24],[102,39,102,42],[102,43,102,46],[109,4,109,18],[109,27,109,30],[109,31,109,34],[109,35,109,38],[109,19,109,21],[113,43,113,46],[111,39,111,42],[111,43,111,46],[158,3,158,50],[156,3,156,26],[156,27,156,30],[156,31,156,34],[156,35,156,38],[156,39,156,42],[114,35,114,38],[111,47,111,50],[112,4,112,18],[112,27,112,30],[112,31,112,34],[112,35,112,38],[112,39,112,42],[112,43,112,46],[113,19,113,21],[113,22,113,24],[113,25,113,26],[111,19,111,21],[111,4,111,18],[111,27,111,30],[110,19,110,21],[111,31,111,34],[111,35,111,38],[112,19,112,21],[112,47,112,50],[136,4,136,18],[136,19,136,21],[136,22,136,24],[136,25,136,26],[113,47,113,50],[114,4,114,18],[114,27,114,30],[114,31,114,34],[160,19,160,30],[21,18,21,21],[36,22,36,24],[37,22,37,24],[30,25,30,26],[31,25,31,26],[32,25,32,26],[33,25,33,26],[36,25,36,26],[37,25,37,26],[34,25,34,26],[21,22,21,25],[29,35,29,38],[29,39,29,42],[29,19,29,21],[30,19,30,21],[30,4,30,18],[31,4,31,18],[42,25,42,26],[104,31,104,34],[104,35,104,38],[104,39,104,42],[104,43,104,46],[42,27,42,30],[42,31,42,34],[42,35,42,38],[42,39,42,42],[20,33,20,38],[20,39,20,44],[159,3,159,18],[159,19,159,30],[21,39,21,44],[21,45,21,50],[20,45,20,50],[22,27,22,32],[22,33,22,38],[22,39,22,44],[22,45,22,50],[113,4,113,18],[113,27,113,30],[113,31,113,34],[113,35,113,38],[113,39,113,42],[41,4,41,18],[41,19,41,21],[41,22,41,24],[41,25,41,26],[41,27,41,30],[41,31,41,34],[43,4,43,18],[43,19,43,21],[43,22,43,24],[43,25,43,26],[43,27,43,30],[43,31,43,34],[43,35,43,38],[43,39,43,42],[43,43,43,46],[29,25,29,26],[4,3,4,30],[26,27,26,50],[26,3,26,26],[19,18,19,25],[14,27,14,50],[32,39,32,42],[33,43,33,46],[33,47,33,50],[34,47,34,50],[35,47,35,50],[34,43,34,46],[35,27,35,30],[29,43,29,46],[29,22,29,24],[29,47,29,50],[27,43,27,50],[28,35,28,38],[15,27,15,32],[15,33,15,38],[15,39,15,44],[20,27,20,32],[17,27,17,32],[16,45,16,50],[17,45,17,50],[15,45,15,50],[19,27,19,50],[16,27,16,32],[16,33,16,38],[17,33,17,38],[21,27,21,32],[21,33,21,38],[24,27,25,50],[181,3,181,50],[32,19,32,21],[33,19,33,21],[34,19,34,21],[35,19,35,21],[36,19,36,21],[114,39,114,42],[160,3,160,18],[114,19,114,21],[114,22,114,24],[114,25,114,26],[38,47,38,50],[39,4,39,18],[39,19,39,21],[39,22,39,24],[39,25,39,26],[40,47,40,50],[38,27,38,30],[38,31,38,34],[38,35,38,38],[38,39,38,42],[38,43,38,46],[37,4,37,18],[32,4,32,18],[33,4,33,18],[37,19,37,21],[38,19,38,21],[38,22,38,24],[38,25,38,26],[42,4,42,18],[42,19,42,21],[42,22,42,24],[16,39,16,44],[17,39,17,44],[28,39,28,42],[28,43,28,46],[18,14,18,17],[19,14,19,17],[20,14,20,17],[17,18,17,21],[17,22,17,25],[18,18,18,21],[18,22,18,25],[20,22,20,25],[40,4,40,18],[40,19,40,21],[40,22,40,24],[40,25,40,26],[27,19,28,21],[27,22,28,24],[27,4,28,18],[19,4,19,13],[21,14,21,17],[22,14,22,17],[29,4,29,18],[32,22,32,24],[33,22,33,24],[34,22,34,24],[35,22,35,24],[31,19,31,21],[24,3,25,26],[27,3,28,3],[27,25,28,26],[38,4,38,18],[42,43,42,46],[45,4,45,18],[45,19,45,21],[45,22,45,24],[45,25,45,26],[45,27,45,30],[45,31,45,34],[45,35,45,38],[45,39,45,42],[45,43,45,46],[44,4,44,18],[44,19,44,21],[44,22,44,24],[44,25,44,26],[44,27,44,30],[44,31,44,34],[44,35,44,38],[44,39,44,42],[44,43,44,46],[47,35,47,38],[47,39,47,42],[47,43,47,46],[100,4,100,18],[100,19,100,21],[100,22,100,24],[100,25,100,26],[100,27,100,30],[100,31,100,34],[100,35,100,38],[66,4,66,18],[67,4,67,18],[48,19,48,21],[48,22,48,24],[48,25,48,26],[48,27,48,30],[49,19,49,21],[49,22,49,24],[49,25,49,26],[49,27,49,30],[99,4,99,18],[99,27,99,30],[88,43,88,46],[98,4,98,18],[98,27,98,30],[97,4,97,18],[99,19,99,21],[93,3,93,26],[93,27,93,50],[89,3,89,26],[89,43,89,46],[89,31,89,34],[46,4,46,18],[46,19,46,21],[46,22,46,24],[53,4,53,18],[54,4,54,18],[55,4,55,18],[56,4,56,18],[57,4,57,18],[58,4,58,18],[59,4,59,18],[60,4,60,18],[61,4,61,18],[62,4,62,18],[63,4,63,18],[64,4,64,18],[65,4,65,18],[46,25,46,26],[53,19,53,21],[53,22,53,24],[53,25,53,26],[65,19,65,21],[65,22,65,24],[65,25,65,26],[46,27,46,30],[46,31,46,34],[46,35,46,38],[46,39,46,42],[46,43,46,46],[47,4,47,18],[47,19,47,21],[47,22,47,24],[47,25,47,26],[47,27,47,30],[47,31,47,34],[48,4,48,18],[49,4,49,18],[50,4,50,18],[51,4,51,18],[52,4,52,18],[13,4,13,13],[13,14,13,17],[14,4,14,13],[50,19,50,21],[50,22,50,24],[50,25,50,26],[50,27,50,30],[51,19,51,21],[51,22,51,24],[51,25,51,26],[51,27,51,30],[52,19,52,21],[52,22,52,24],[52,25,52,26],[52,27,52,30],[48,39,48,42],[13,3,14,3],[13,18,13,21]],"merged_total":1391,"flags":["merged_cut"]}
[]
[]
[]
[]
[null,null,null,"DOĞRUDAN TEMİN PROGRAMI"]
[]
[null,null,null,"Üst İdare Adı",null,null,null,null,null,null,null,null,null,null,"BULANIK KAYMAKAMLIĞI"]
[null,null,null,"İdare Adı",null,null,null,null,null,null,null,null,null,null,"Atatürk İlkokulu Müdürlüğü",null,null,null,null,null,null,null,null,null,null,null,null,null,null,null,null,null,null,null,null,null,null,null,null,"ne"]
[null,null,null,"Mal/Hizmet/Yapım Adı, Niteliği ",null,null,null,null,null,null,null,null,null,null,"Bilişim Malzemeleri Alımı"]
[null,null,null,"Alım/Temin Usulü",null,null,null,null,null,null,null,null,null,null,"22/d"]
[null,null,null,"DTN (Doğrudan Temin Numarası)",null,null,null,null,null,null,null,null,null,null,"22DT1211930"]
[null,null,null,null,null,null,null,null,null,null,null,null,null,null,null,null,null,null,null,null,null,null,null,null,null,null,null,"Bütçe Tertibi",null,null,null,null,null,null,null,"6.98.255.9436.13.67.01.03.05.30.02"]
[null,null,null,"NO","BELGE ADI/ BELGE AÇ",null,null,null,null,null,null,null,null,null,"TARİHİ",null,null,null,"ÖNİZLEME",null,null,null,"YAZDIRMA",null,null,null,null,"Kullanılabilir Ödenek Tutarı",null,null,null,null,null,null,null,45000]
[null,null,null,1,"Alım/Görevlendirme Oluru"]
[null,null,null,null,"Alım/Görevlendirme Oluru Tarihi-Sayısı  >>",null,null,null,null,null,null,null,null,null,"2023-03-06",null,null,null,456789123,null,null,null,null,null,null,null,null,"PİYASA ARAŞTIRMA GÖREVLİLERİ"]
[null,null,null,2,"Yaklaşık Maliyet Araştırma Yazısı",null,null,null,null,null,null,null,null,null,"2023-03-06",null,null,null,null,null,null,null,null,null,null,null,null,"Piyasa Araştırma Görevlisi",null,null,null,null,null,"Piyasa Araştırma Görevlisi",null,null,null,null,null,"Piyasa Araştırma Görevlisi",null,null,null,null,null,"OLUR/UYGUNDUR"]
[null,null,null,3,"Yaklaşık Maliyet Hesap Cetveli",null,null,null,null,null,null,null,null,null,"2023-03-07",null,null,null,null,null,null,null,null,null,null,null,null,"Ahmet DEMİR",null,null,null,null,null,"Ayşe YILDIZ",null,null,null,null,null,null,null,null,null,null,null,"Mustafa AYDIN"]
[null,null,null,4,"Doğrudan Temin Onay Belgesi",null,null,null,null,null,null,null,null,null,"2023-03-06",null,null,null,null,null,null,null,null,null,null,null,null,"Müdür Yardımcısı 1",null,null,null,null,null,"Öğretmen 1",null,null,null,null,null,null,null,null,null,null,null,"Okul Müdürü"]
[null,null,null,5,"Teklif Vermeye Davet Yazısı",null,null,null,null,null,null,null,null,null,"2023-03-06"]
[null,null,null,null,"  Teklif Geçerlilik Tarihi                   >>",null,null,null,null,null,null,null,null,null,"2023-03-08",null,null,null,null,null,null,null,null,null,null,null,null,"MUAYENE VE KABUL GÖREVLİLERİ"]
[null,null,null,6,"İdari veTeknik Şartlar",null,null,null,null,null,null,null,null,null,null,null,null,null,null,null,null,null,null,null,null,null,null,"Muayene ve Kabul Görevlisi",null,null,null,null,null,"Muayene ve Kabul Görevlisi",null,null,null,null,null,"Muayene ve Kabul Görevlisi",null,null,null,null,null,"OLUR/UYGUNDUR"]
[null,null,null,7,"Piyasa Araştırma Tutanağı",null,null,null,null,null,null,null,null,null,"2023-03-08",null,null,null,null,null,null,null,null,null,null,null,null,"Mehmet  ÇELİK",null,null,null,null,null,"Fatma GÜNEŞ",null,null,null,null,null,null,null,null,null,null,null,"Mustafa AYDIN"]
[null,null,null,8,"Muayene ve Kabul Tutanağı",null,null,null,null,null,null,null,null,null,"2023-03-08",null,null,null,null,null,null,null,null,null,null,null,null,"Müdür Yardımcısı 2",null,null,null,null,null,"Öğretmen 2",null,null,null,null,null,null,null,null,null,null,null,"Okul Müdürü"]
[]
[null,null,null,null,null,null,null,null,null,null,null,null,null,null,null,null,null,null,null,null,null,null,null,null,null,null,null,"YAKLAŞIK MALİYET ARAŞTIRMASI"]
[]
[null,null,null,"MAL'IN/HİZMET'İN/YAPIM İŞİ'NİN",null,null,null,null,null,null,null,null,null,null,null,null,null,null,null,null,null,null,null,null,null,null,null,"ARAŞTIRMA YAPILAN KİŞİLER/FİRMALAR VE VERDİKLERİ FİYATLAR (KDV HARİÇ)"]
[null,null,null,"S",{"$f":"IF((COUNTIF(BA29:BA89,\"*x*\"))>=1,\"Bu alanda (x ile işaretlenen satırda) hücrelerin birinde veya birkaçında fazla veri var! Siliniz!\",\"ADI\")","v":"ADI"},null,null,null,null,null,null,null,null,null,null,null,null,null,null,"MİKTARI",null,null,"BİRİMİ",null,null,"KDV\n(%)",null,"A GERÇEK/TÜZEL KİŞİSİ",null,null,null,null,null,null,null,"B GERÇEK/TÜZEL KİŞİSİ",null,null,null,null,null,null,null,"C GERÇEK/TÜZEL KİŞİSİ",null,null,null,null,null,null,null,null,null,null,null,null,null,null,null,null,null,null,null,null,null,1,1]
[null,null,null,null,null,null,null,null,null,null,null,null,null,null,null,null,null,null,null,null,null,null,null,null,null,null,null,"Birim Fiyatı",null,null,null,"Toplam Fiyatı",null,null,null,"Birim Fiyatı",null,null,null,"Toplam Fiyatı",null,null,null,"Birim Fiyatı",null,null,null,"Toplam Fiyatı "]
[null,null,null,{"$f":"IF(E30=\"\",\"\",1)","v":1},"AIO (All In One) Masaüstü Bilgisayar ",null,null,null,null,null,null,null,null,null,null,null,null,null,null,2,null,null,"Adet",null,null,20,null,2000,null,null,null,{"$f":"IF(AB30=\"\",\"\",T30*AB30)","v":4000},null,null,null,3000,null,null,null,{"$f":"IF(AB30=\"\",\"\",T30*AJ30)","v":6000},null,null,null,4000,null,null,null,{"$f":"IF(AB30=\"\",\"\",T30*AR30)","v":8000},null,null,null,null,{"$f":"IF(E30=\"\",IF(OR(T30<>\"\",W30<>\"\",Z30<>\"\",AB30<>\"\",AJ30<>\"\",AR30<>\"\"),\"x\",\"\"),\"✓\")","v":"✓"}]
[null,null,null,{"$f":"IF(E31=\"\",\"\",2)","v":2},"Fotokopi Makinesi",null,null,null,null,null,null,null,null,null,null,null,null,null,null,2,null,null,"Adet",null,null,10,null,3000,null,null,null,{"$f":"IF(AB31=\"\",\"\",T31*AB31)","v":6000},null,null,null,4000,null,null,null,{"$f":"IF(AB31=\"\",\"\",T31*AJ31)","v":8000},null,null,null,5000,null,null,null,{"$f":"IF(AB31=\"\",\"\",T31*AR31)","v":10000},null,null,null,null,{"$f":"IF(E31=\"\",IF(OR(T31<>\"\",W31<>\"\",Z31<>\"\",AB31<>\"\",AJ31<>\"\",AR31<>\"\"),\"x\",\"\"),\"✓\")","v":"✓"}]
[null,null,null,{"$f":"IF(E32=\"\",\"\",3)","v":3},"Projektör",null,null,null,null,null,null,null,null,null,null,null,null,null,null,2,null,null,"Adet",null,null,1,null,4000,null,null,null,8000,null,null,null,5000,null,null,null,10000,null,null,null,6000,null,null,null,12000,null,null,null,null,"✓"]
[null,null,null,{"$f":"IF(E33=\"\",\"\",4)","v":""},null,null,null,null,null,null,null,null,null,null,null,null,null,null,null,null,null,null,null,null,null,null,null,null,null,null,null,"",null,null,null,null,null,null,null,"",null,null,null,null,null,null,null,"",null,null,null,null,""]
[null,null,null,{"$f":"IF(E34=\"\",\"\",5)","v":""},null,null,null,null,null,null,null,null,null,null,null,null,null,null,null,null,null,null,null,null,null,null,null,null,null,null,null,"",null,null,null,null,null,null,null,"",null,null,null,null,null,null,null,"",null,null,null,null,""]
[null,null,null,{"$f":"IF(E35=\"\",\"\",6)","v":""},null,null,null,null,null,null,null,null,null,null,null,null,null,null,null,null,null,null,null,null,null,null,null,null,null,null,null,"",null,null,null,null,null,null,null,"",null,null,null,null,null,null,null,"",null,null,null,null,""]
[null,null,null,{"$f":"IF(E36=\"\",\"\",7)","v":""},null,null,null,null,null,null,null,null,null,null,null,null,null,null,null,null,null,null,null,null,null,null,null,null,null,null,null,"",null,null,null,null,null,null,null,"",null,null,null,null,null,null,null,"",null,null,null,null,""]
[null,null,null,{"$f":"IF(E37=\"\",\"\",8)","v":""},null,null,null,null,null,null,null,null,null,null,null,null,null,null,null,null,null,null,null,null,null,null,null,null,null,null,null,"",null,null,null,null,null,null,null,"",null,null,null,null,null,null,null,"",null,null,null,null,""]
[null,null,null,{"$f":"IF(E38=\"\",\"\",9)","v":""},null,null,null,null,null,null,null,null,null,null,null,null,null,null,null,null,null,null,null,null,null,null,null,null,null,null,null,"",null,null,null,null,null,null,null,"",null,null,null,null,null,null,null,"",null,null,null,null,""]
[null,null,null,{"$f":"IF(E39=\"\",\"\",10)","v":""},null,null,null,null,null,null,null,null,null,null,null,null,null,null,null,null,null,null,null,null,null,null,null,null,null,null,null,"",null,null,null,null,null,null,null,"",null,null,null,null,null,null,null,"",null,null,null,null,""]
[null,null,null,{"$f":"IF(E40=\"\",\"\",11)","v":""},null,null,null,null,null,null,null,null,null,null,null,null,null,null,null,null,null,null,null,null,null,null,null,null,null,null,null,"",null,null,null,null,null,null,null,"",null,null,null,null,null,null,null,"",null,null,null,null,""]
[null,null,null,{"$f":"IF(E41=\"\",\"\",12)","v":""},null,null,null,null,null,null,null,null,null,null,null,null,null,null,null,null,null,null,null,null,null,null,null,null,null,null,null,"",null,null,null,null,null,null,null,"",null,null,null,null,null,null,null,"",null,null,null,null,""]
[null,null,null,{"$f":"IF(E42=\"\",\"\",13)","v":""},null,null,null,null,null,null,null,null,null,null,null,null,null,null,null,null,null,null,null,null,null,null,null,null,null,null,null,"",null,null,null,null,null,null,null,"",null,null,null,null,null,null,null,"",null,null,null,null,""]
[null,null,null,{"$f":"IF(E43=\"\",\"\",14)","v":""},null,null,null,null,null,null,null,null,null,null,null,null,null,null,null,null,null,null,null,null,null,null,null,null,null,null,null,"",null,null,null,null,null,null,null,"",null,null,null,null,null,null,null,"",null,null,null,null,""]
[null,null,null,{"$f":"IF(E44=\"\",\"\",15)","v":""},null,null,null,null,null,null,null,null,null,null,null,null,null,null,null,null,null,null,null,null,null,null,null,null,null,null,null,"",null,null,null,null,null,null,null,"",null,null,null,null,null,null,null,"",null,null,null,null,""]
[null,null,null,{"$f":"IF(E45=\"\",\"\",16)","v":""},null,null,null,null,null,null,null,null,null,null,null,null,null,null,null,null,null,null,null,null,null,null,null,null,null,null,null,"",null,null,null,null,null,null,null,"",null,null,null,null,null,null,null,"",null,null,null,null,""]
[null,null,null,{"$f":"IF(E46=\"\",\"\",17)","v":""},null,null,null,null,null,null,null,null,null,null,null,null,null,null,null,null,null,null,null,null,null,null,null,null,null,null,null,"",null,null,null,null,null,null,null,"",null,null,null,null,null,null,null,"",null,null,null,null,""]
[null,null,null,{"$f":"IF(E47=\"\",\"\",18)","v":""},null,null,null,null,null,null,null,null,null,null,null,null,null,null,null,null,null,null,null,null,null,null,null,null,null,null,null,"",null,null,null,null,null,null,null,"",null,null,null,null,null,null,null,"",null,null,null,null,""]
[null,null,null,{"$f":"IF(E48=\"\",\"\",19)","v":""},null,null,null,null,null,null,null,null,null,null,null,null,null,null,null,null,null,null,null,null,null,null,null,null,null,null,null,"",null,null,null,null,null,null,null,"",null,null,null,null,null,null,null,"",null,null,null,null,""]
[null,null,null,{"$f":"IF(E49=\"\",\"\",20)","v":""},null,null,null,null,null,null,null,null,null,null,null,null,null,null,null,null,null,null,null,null,null,null,null,null,null,null,null,"",null,null,null,null,null,null,null,"",null,null,null,null,null,null,null,"",null,null,null,null,""]
[null,null,null,{"$f":"IF(E50=\"\",\"\",21)","v":""},null,null,null,null,null,null,null,null,null,null,null,null,null,null,null,null,null,null,null,null,null,null,null,null,null,null,null,"",null,null,null,null,null,null,null,"",null,null,null,null,null,null,null,"",null,null,null,null,""]
[null,null,null,{"$f":"IF(E51=\"\",\"\",22)","v":""},null,null,null,null,null,null,null,null,null,null,null,null,null,null,null,null,null,null,null,null,null,null,null,null,null,null,null,"",null,null,null,null,null,null,null,"",null,null,null,null,null,null,null,"",null,null,null,null,""]
[null,null,null,{"$f":"IF(E52=\"\",\"\",23)","v":""},null,null,null,null,null,null,null,null,null,null,null,null,null,null,null,null,null,null,null,null,null,null,null,null,null,null,null,"",null,null,null,null,null,null,null,"",null,null,null,null,null,null,null,"",null,null,null,null,""]
[null,null,null,{"$f":"IF(E53=\"\",\"\",24)","v":""},null,null,null,null,null,null,null,null,null,null,null,null,null,null,null,null,null,null,null,null,null,null,null,null,null,null,null,"",null,null,null,null,null,null,null,"",null,null,null,null,null,null,null,"",null,null,null,null,""]
[null,null,null,{"$f":"IF(E54=\"\",\"\",25)","v":""},null,null,null,null,null,null,null,null,null,null,null,null,null,null,null,null,null,null,null,null,null,null,null,null,null,null,null,"",null,null,null,null,null,null,null,"",null,null,null,null,null,null,null,"",null,null,null,null,""]
[null,null,null,{"$f":"IF(E55=\"\",\"\",26)","v":""},null,null,null,null,null,null,null,null,null,null,null,null,null,null,null,null,null,null,null,null,null,null,null,null,null,null,null,"",null,null,null,null,null,null,null,"",null,null,null,null,null,null,null,"",null,null,null,null,""]
[null,null,null,{"$f":"IF(E56=\"\",\"\",27)","v":""},null,null,null,null,null,null,null,null,null,null,null,null,null,null,null,null,null,null,null,null,null,null,null,null,null,null,null,"",null,null,null,null,null,null,null,"",null,null,null,null,null,null,null,"",null,null,null,null,""]
[null,null,null,{"$f":"IF(E57=\"\",\"\",28)","v":""},null,null,null,null,null,null,null,null,null,null,null,null,null,null,null,null,null,null,null,null,null,null,null,null,null,null,null,"",null,null,null,null,null,null,null,"",null,null,null,null,null,null,null,"",null,null,null,null,""]
[null,null,null,{"$f":"IF(E58=\"\",\"\",29)","v":""},null,null,null,null,null,null,null,null,null,null,null,null,null,null,null,null,null,null,null,null,null,null,null,null,null,null,null,"",null,null,null,null,null,null,null,"",null,null,null,null,null,null,null,"",null,null,null,null,""]
[null,null,null,{"$f":"IF(E59=\"\",\"\",30)","v":""},null,null,null,null,null,null,null,null,null,null,null,null,null,null,null,null,null,null,null,null,null,null,null,null,null,null,null,"",null,null,null,null,null,null,null,"",null,null,null,null,null,null,null,"",null,null,null,null,""]
[null,null,null,{"$f":"IF(E60=\"\",\"\",31)","v":""},null,null,null,null,null,null,null,null,null,null,null,null,null,null,null,null,null,null,null,null,null,null,null,null,null,null,null,"",null,null,null,null,null,null,null,"",null,null,null,null,null,null,null,"",null,null,null,null,""]
[null,null,null,{"$f":"IF(E61=\"\",\"\",32)","v":""},null,null,null,null,null,null,null,null,null,null,null,null,null,null,null,null,null,null,null,null,null,null,null,null,null,null,null,"",null,null,null,null,null,null,null,"",null,null,null,null,null,null,null,"",null,null,null,null,""]
[null,null,null,{"$f":"IF(E62=\"\",\"\",33)","v":""},null,null,null,null,null,null,null,null,null,null,null,null,null,null,null,null,null,null,null,null,null,null,null,null,null,null,null,"",null,null,null,null,null,null,null,"",null,null,null,null,null,null,null,"",null,null,null,null,""]
[null,null,null,{"$f":"IF(E63=\"\",\"\",34)","v":""},null,null,null,null,null,null,null,null,null,null,null,null,null,null,null,null,null,null,null,null,null,null,null,null,null,null,null,"",null,null,null,null,null,null,null,"",null,null,null,null,null,null,null,"",null,null,null,null,""]
[null,null,null,{"$f":"IF(E64=\"\",\"\",35)","v":""},null,null,null,null,null,null,null,null,null,null,null,null,null,null,null,null,null,null,null,null,null,null,null,null,null,null,null,"",null,null,null,null,null,null,null,"",null,null,null,null,null,null,null,"",null,null,null,null,""]
[null,null,null,{"$f":"IF(E65=\"\",\"\",36)","v":""},null,null,null,null,null,null,null,null,null,null,null,null,null,null,null,null,null,null,null,null,null,null,null,null,null,null,null,"",null,null,null,null,null,null,null,"",null,null,null,null,null,null,null,"",null,null,null,null,""]
[null,null,null,{"$f":"IF(E66=\"\",\"\",37)","v":""},null,null,null,null,null,null,null,null,null,null,null,null,null,null,null,null,null,null,null,null,null,null,null,null,null,null,null,"",null,null,null,null,null,null,null,"",null,null,null,null,null,null,null,"",null,null,null,null,""]
[null,null,null,{"$f":"IF(E67=\"\",\"\",38)","v":""},null,null,null,null,null,null,null,null,null,null,null,null,null,null,null,null,null,null,null,null,null,null,null,null,null,null,null,"",null,null,null,null,null,null,null,"",null,null,null,null,null,null,null,"",null,null,null,null,""]
[null,null,null,{"$f":"IF(E68=\"\",\"\",39)","v":""},null,null,null,null,null,null,null,null,null,null,null,null,null,null,null,null,null,null,null,null,null,null,null,null,null,null,null,"",null,null,null,null,null,null,null,"",null,null,null,null,null,null,null,"",null,null,null,null,""]
[null,null,null,{"$f":"IF(E69=\"\",\"\",40)","v":""},null,null,null,null,null,null,null,null,null,null,null,null,null,null,null,null,null,null,null,null,null,null,null,null,null,null,null,"",null,null,null,null,null,null,null,"",null,null,null,null,null,null,null,"",null,null,null,null,""]
[null,null,null,{"$f":"IF(E70=\"\",\"\",41)","v":""},null,null,null,null,null,null,null,null,null,null,null,null,null,null,null,null,null,null,null,null,null,null,null,null,null,null,null,"",null,null,null,null,null,null,null,"",null,null,null,null,null,null,null,"",null,null,null,null,""]
[null,null,null,{"$f":"IF(E71=\"\",\"\",42)","v":""},null,null,null,null,null,null,null,null,null,null,null,null,null,null,null,null,null,null,null,null,null,null,null,null,null,null,null,"",null,null,null,null,null,null,null,"",null,null,null,null,null,null,null,"",null,null,null,null,""]
[null,null,null,{"$f":"IF(E72=\"\",\"\",43)","v":""},null,null,null,null,null,null,null,null,null,null,null,null,null,null,null,null,null,null,null,null,null,null,null,null,null,null,null,"",null,null,null,null,null,null,null,"",null,null,null,null,null,null,null,"",null,null,null,null,""]
[null,null,null,{"$f":"IF(E73=\"\",\"\",44)","v":""},null,null,null,null,null,null,null,null,null,null,null,null,null,null,null,null,null,null,null,null,null,null,null,null,null,null,null,"",null,null,null,null,null,null,null,"",null,null,null,null,null,null,null,"",null,null,null,null,""]
[null,null,null,{"$f":"IF(E74=\"\",\"\",45)","v":""},null,null,null,null,null,null,null,null,null,null,null,null,null,null,null,null,null,null,null,null,null,null,null,null,null,null,null,"",null,null,null,null,null,null,null,"",null,null,null,null,null,null,null,"",null,null,null,null,""]
[null,null,null,{"$f":"IF(E75=\"\",\"\",46)","v":""},null,null,null,null,null,null,null,null,null,null,null,null,null,null,null,null,null,null,null,null,null,null,null,null,null,null,null,"",null,null,null,null,null,null,null,"",null,null,null,null,null,null,null,"",null,null,null,null,""]
[null,null,null,{"$f":"IF(E76=\"\",\"\",47)","v":""},null,null,null,null,null,null,null,null,null,null,null,null,null,null,null,null,null,null,null,null,null,null,null,null,null,null,null,"",null,null,null,null,null,null,null,"",null,null,null,null,null,null,null,"",null,null,null,null,""]
[null,null,null,{"$f":"IF(E77=\"\",\"\",48)","v":""},null,null,null,null,null,null,null,null,null,null,null,null,null,null,null,null,null,null,null,null,null,null,null,null,null,null,null,"",null,null,null,null,null,null,null,"",null,null,null,null,null,null,null,"",null,null,null,null,""]
[null,null,null,{"$f":"IF(E78=\"\",\"\",49)","v":""},null,null,null,null,null,null,null,null,null,null,null,null,null,null,null,null,null,null,null,null,null,null,null,null,null,null,null,"",null,null,null,null,null,null,null,"",null,null,null,null,null,null,null,"",null,null,null,null,""]
[null,null,null,{"$f":"IF(E79=\"\",\"\",50)","v":""},null,null,null,null,null,null,null,null,null,null,null,null,null,null,null,null,null,null,null,null,null,null,null,null,null,null,null,"",null,null,null,null,null,null,null,"",null,null,null,null,null,null,null,"",null,null,null,null,""]
[null,null,null,{"$f":"IF(E80=\"\",\"\",51)","v":""},null,null,null,null,null,null,null,null,null,null,null,null,null,null,null,null,null,null,null,null,null,null,null,null,null,null,null,"",null,null,null,null,null,null,null,"",null,null,null,null,null,null,null,"",null,null,null,null,""]
[null,null,null,{"$f":"IF(E81=\"\",\"\",52)","v":""},null,null,null,null,null,null,null,null,null,null,null,null,null,null,null,null,null,null,null,null,null,null,null,null,null,null,null,"",null,null,null,null,null,null,null,"",null,null,null,null,null,null,null,"",null,null,null,null,""]
[null,null,null,{"$f":"IF(E82=\"\",\"\",53)","v":""},null,null,null,null,null,null,null,null,null,null,null,null,null,null,null,null,null,null,null,null,null,null,null,null,null,null,null,"",null,null,null,null,null,null,null,"",null,null,null,null,null,null,null,"",null,null,null,null,""]
[null,null,null,{"$f":"IF(E83=\"\",\"\",54)","v":""},null,null,null,null,null,null,null,null,null,null,null,null,null,null,null,null,null,null,null,null,null,null,null,null,null,null,null,"",null,null,null,null,null,null,null,"",null,null,null,null,null,null,null,"",null,null,null,null,""]
[null,null,null,{"$f":"IF(E84=\"\",\"\",55)","v":""},null,null,null,null,null,null,null,null,null,null,null,null,null,null,null,null,null,null,null,null,null,null,null,null,null,null,null,"",null,null,null,null,null,null,null,"",null,null,null,null,null,null,null,"",null,null,null,null,""]
[null,null,null,{"$f":"IF(E85=\"\",\"\",56)","v":""},null,null,null,null,null,null,null,null,null,null,null,null,null,null,null,null,null,null,null,null,null,null,null,null,null,null,null,"",null,null,null,null,null,null,null,"",null,null,null,null,null,null,null,"",null,null,null,null,""]
[null,null,null,{"$f":"IF(E86=\"\",\"\",57)","v":""},null,null,null,null,null,null,null,null,null,null,null,null,null,null,null,null,null,null,null,null,null,null,null,null,null,null,null,"",null,null,null,null,null,null,null,"",null,null,null,null,null,null,null,"",null,null,null,null,""]
[null,null,null,{"$f":"IF(E87=\"\",\"\",58)","v":""},null,null,null,null,null,null,null,null,null,null,null,null,null,null,null,null,null,null,null,null,null,null,null,null,null,null,null,"",null,null,null,null,null,null,null,"",null,null,null,null,null,null,null,"",null,null,null,null,""]
[null,null,null,{"$f":"IF(E88=\"\",\"\",59)","v":""},null,null,null,null,null,null,null,null,null,null,null,null,null,null,null,null,null,null,null,null,null,null,null,null,null,null,null,"",null,null,null,null,null,null,null,"",null,null,null,null,null,null,null,"",null,null,null,null,""]
[null,null,null,{"$f":"IF(E89=\"\",\"\",60)","v":""},null,null,null,null,null,null,null,null,null,null,null,null,null,null,null,null,null,null,null,null,null,null,null,null,null,null,null,"",null,null,null,null,null,null,null,{"$f":"IF(AB89=\"\",\"\",T89*AJ89)","v":""},null,null,null,null,null,null,null,"",null,null,null,null,""]
[null,null,null,"TOPLAM (KDV Hariç)",null,null,null,null,null,null,null,null,null,null,null,null,null,null,null,null,null,null,null,null,null,null,null,{"$f":"SUM(AB30:AB89)","v":9000},null,null,null,{"$f":"SUM(AF30:AF89)","v":18000},null,null,null,{"$f":"SUM(AJ30:AJ89)","v":12000},null,null,null,{"$f":"SUM(AN30:AN89)","v":24000},null,null,null,{"$f":"SUM(AR30:AR89)","v":15000},null,null,null,{"$f":"SUM(AV30:AV89)","v":30000}]
[]
[null,null,null,null,null,null,null,null,null,null,null,null,null,null,null,null,null,null,null,null,null,null,null,null,null,null,null,"PİYASA FİYAT ARAŞTIRMASI"]
[]
[null,null,null,"MAL'IN/HİZMET'İN/YAPIM İŞİ'NİN",null,null,null,null,null,null,null,null,null,null,null,null,null,null,null,null,null,null,null,null,null,null,null,"TEKLİF VEREN KİŞİLER/FİRMALAR VE TEKLİF FİYATLARI (KDV HARİÇ)"]
[null,null,null,"S",{"$f":"IF((COUNTIF(BA97:BA156,\"*x*\"))>=1,\"Bu alanda (x ile işaretlenen satırda) hücrelerin birinde veya birkaçında fazla veri var! Siliniz!\",\"ADI\")","v":"ADI"},null,null,null,null,null,null,null,null,null,null,null,null,null,null,"BİRİMİ",null,null,"MİKTARI",null,null,"KDV\n(%)",null,"A GERÇEK/TÜZEL KİŞİSİ",null,null,null,null,null,null,null,"B GERÇEK/TÜZEL KİŞİSİ",null,null,null,null,null,null,null,"D GERÇEK/TÜZEL KİŞİSİ",null,null,null,null,null,null,null,null,null,null,{"$f":"AB95","v":"A GERÇEK/TÜZEL KİŞİSİ"},null,null,{"$f":"AJ95","v":"B GERÇEK/TÜZEL KİŞİSİ"},null,null,{"$f":"AR95","v":"D GERÇEK/TÜZEL KİŞİSİ"}]
[null,null,null,null,null,null,null,null,null,null,null,null,null,null,null,null,null,null,null,null,null,null,null,null,null,null,null,"Birim Fiyatı",null,null,null,"Toplam Fiyatı",null,null,null,"Birim Fiyatı",null,null,null,"Toplam Fiyatı",null,null,null,"Birim Fiyatı",null,null,null,"Toplam Fiyatı",null,null,null,null,null,null,20,10,1,20,10,1,20,10,1]
[null,null,null,{"$f":"IF(D30=\"\",\"\",D30)","v":1},"AIO (All In One) Masaüstü Bilgisayar ",null,null,null,null,null,null,null,null,null,null,null,null,null,null,{"$f":"IF(T30=\"\",\"\",T30)","v":2},null,null,{"$f":"IF(W30=\"\",\"\",W30)","v":"Adet"},null,null,{"$f":"IF(Z30=\"\",\"\",Z30)","v":20},null,3000,null,null,null,{"$f":"IF(AB97=\"\",\"\",T97*AB97)","v":6000},null,null,null,4000,null,null,null,{"$f":"IF(AB97=\"\",\"\",T97*AJ97)","v":8000},null,null,null,5000,null,null,null,{"$f":"IF(T97=\"\",\"\",T97*AR97)","v":10000},null,null,null,null,{"$f":"IF(E97=\"\",IF(OR(AB97<>\"\",AJ97<>\"\",AR97<>\"\"),\"x\",\"\"),\"✓\")","v":"✓"},null,{"$f":"IF(Z97=20,(AF97*20/100),\"\")","v":1200},{"$f":"IF(Z97=10,(AF97*10/100),\"\")","v":""},{"$f":"IF(Z97=1,(AF97*1/100),\"\")","v":""},{"$f":"IF(Z97=20,(AN97*20/100),\"\")","v":1600},{"$f":"IF(Z97=10,(AN97*10/100),\"\")","v":""},{"$f":"IF(Z97=1,(AN97*1/100),\"\")","v":""},{"$f":"IF(Z97=20,(AV97*20/100),\"\")","v":2000},{"$f":"IF(Z97=10,(AV97*10/100),\"\")","v":""},{"$f":"IF(Z97=1,(AV97*1/100),\"\")","v":""}]
[null,null,null,{"$f":"IF(D31=\"\",\"\",D31)","v":2},{"$f":"IF(E31=\"\",\"\",E31)","v":"Fotokopi Makinesi"},null,null,null,null,null,null,null,null,null,null,null,null,null,null,2,null,null,"Adet",null,null,10,null,4000,null,null,null,{"$f":"IF(AB98=\"\",\"\",T98*AB98)","v":8000},null,null,null,5000,null,null,null,{"$f":"IF(AB98=\"\",\"\",T98*AJ98)","v":10000},null,null,null,6000,null,null,null,{"$f":"IF(T98=\"\",\"\",T98*AR98)","v":12000},null,null,null,null,{"$f":"IF(E98=\"\",IF(OR(AB98<>\"\",AJ98<>\"\",AR98<>\"\"),\"x\",\"\"),\"✓\")","v":"✓"},null,{"$f":"IF(Z98=20,(AF98*20/100),\"\")","v":""},{"$f":"IF(Z98=10,(AF98*10/100),\"\")","v":800},{"$f":"IF(Z98=1,(AF98*1/100),\"\")","v":""},{"$f":"IF(Z98=20,(AN98*20/100),\"\")","v":""},{"$f":"IF(Z98=10,(AN98*10/100),\"\")","v":1000},{"$f":"IF(Z98=1,(AN98*1/100),\"\")","v":""},{"$f":"IF(Z98=20,(AV98*20/100),\"\")","v":""},{"$f":"IF(Z98=10,(AV98*10/100),\"\")","v":1200},{"$f":"IF(Z98=1,(AV98*1/100),\"\")","v":""}]
[null,null,null,{"$f":"IF(D32=\"\",\"\",D32)","v":3},{"$f":"IF(E32=\"\",\"\",E32)","v":"Projektör"},null,null,null,null,null,null,null,null,null,null,null,null,null,null,2,null,null,"Adet",null,null,1,null,5000,null,null,null,10000,null,null,null,6000,null,null,null,12000,null,null,null,7000,null,null,null,14000,null,null,null,null,"✓",null,"","",100,"","",120,"","",140]
[null,null,null,{"$f":"IF(D33=\"\",\"\",D33)","v":""},{"$f":"IF(E33=\"\",\"\",E33)","v":""},null,null,null,null,null,null,null,null,null,null,null,null,null,null,"",null,null,"",null,null,"",null,null,null,null,null,"",null,null,null,null,null,null,null,"",null,null,null,null,null,null,null,"",null,null,null,null,"",null,"","","","","","","","",""]
[null,null,null,{"$f":"IF(D34=\"\",\"\",D34)","v":""},{"$f":"IF(E34=\"\",\"\",E34)","v":""},null,null,null,null,null,null,null,null,null,null,null,null,null,null,"",null,null,"",null,null,"",null,null,null,null,null,"",null,null,null,null,null,null,null,"",null,null,null,null,null,null,null,"",null,null,null,null,"",null,"","","","","","","","",""]
[null,null,null,{"$f":"IF(D35=\"\",\"\",D35)","v":""},{"$f":"IF(E35=\"\",\"\",E35)","v":""},null,null,null,null,null,null,null,null,null,null,null,null,null,null,"",null,null,"",null,null,"",null,null,null,null,null,"",null,null,null,null,null,null,null,"",null,null,null,null,null,null,null,"",null,null,null,null,"",null,"","","","","","","","",""]
[null,null,null,{"$f":"IF(D36=\"\",\"\",D36)","v":""},{"$f":"IF(E36=\"\",\"\",E36)","v":""},null,null,null,null,null,null,null,null,null,null,null,null,null,null,"",null,null,"",null,null,"",null,null,null,null,null,"",null,null,null,null,null,null,null,"",null,null,null,null,null,null,null,"",null,null,null,null,"",null,"","","","","","","","",""]
[null,null,null,{"$f":"IF(D37=\"\",\"\",D37)","v":""},{"$f":"IF(E37=\"\",\"\",E37)","v":""},null,null,null,null,null,null,null,null,null,null,null,null,null,null,"",null,null,"",null,null,"",null,null,null,null,null,"",null,null,null,null,null,null,null,"",null,null,null,null,null,null,null,"",null,null,null,null,"",null,"","","","","","","","",""]
[null,null,null,{"$f":"IF(D38=\"\",\"\",D38)","v":""},{"$f":"IF(E38=\"\",\"\",E38)","v":""},null,null,null,null,null,null,null,null,null,null,null,null,null,null,"",null,null,"",null,null,"",null,null,null,null,null,"",null,null,null,null,null,null,null,"",null,null,null,null,null,null,null,"",null,null,null,null,"",null,"","","","","","","","",""]
[null,null,null,{"$f":"IF(D39=\"\",\"\",D39)","v":""},{"$f":"IF(E39=\"\",\"\",E39)","v":""},null,null,null,null,null,null,null,null,null,null,null,null,null,null,"",null,null,"",null,null,"",null,null,null,null,null,"",null,null,null,null,null,null,null,"",null,null,null,null,null,null,null,"",null,null,null,null,"",null,"","","","","","","","",""]
[null,null,null,{"$f":"IF(D40=\"\",\"\",D40)","v":""},{"$f":"IF(E40=\"\",\"\",E40)","v":""},null,null,null,null,null,null,null,null,null,null,null,null,null,null,"",null,null,"",null,null,"",null,null,null,null,null,"",null,null,null,null,null,null,null,"",null,null,null,null,null,null,null,"",null,null,null,null,"",null,"","","","","","","","",""]
[null,null,null,{"$f":"IF(D41=\"\",\"\",D41)","v":""},{"$f":"IF(E41=\"\",\"\",E41)","v":""},null,null,null,null,null,null,null,null,null,null,null,null,null,null,"",null,null,"",null,null,"",null,null,null,null,null,"",null,null,null,null,null,null,null,"",null,null,null,null,null,null,null,"",null,null,null,null,"",null,"","","","","","","","",""]
[null,null,null,{"$f":"IF(D42=\"\",\"\",D42)","v":""},{"$f":"IF(E42=\"\",\"\",E42)","v":""},null,null,null,null,null,null,null,null,null,null,null,null,null,null,"",null,null,"",null,null,"",null,null,null,null,null,"",null,null,null,null,null,null,null,"",null,null,null,null,null,null,null,"",null,null,null,null,"",null,"","","","","","","","",""]
[null,null,null,{"$f":"IF(D43=\"\",\"\",D43)","v":""},{"$f":"IF(E43=\"\",\"\",E43)","v":""},null,null,null,null,null,null,null,null,null,null,null,null,null,null,"",null,null,"",null,null,"",null,null,null,null,null,"",null,null,null,null,null,null,null,"",null,null,null,null,null,null,null,"",null,null,null,null,"",null,"","","","","","","","",""]
[null,null,null,{"$f":"IF(D44=\"\",\"\",D44)","v":""},{"$f":"IF(E44=\"\",\"\",E44)","v":""},null,null,null,null,null,null,null,null,null,null,null,null,null,null,"",null,null,"",null,null,"",null,null,null,null,null,"",null,null,null,null,null,null,null,"",null,null,null,null,null,null,null,"",null,null,null,null,"",null,"","","","","","","","",""]
[null,null,null,{"$f":"IF(D45=\"\",\"\",D45)","v":""},{"$f":"IF(E45=\"\",\"\",E45)","v":""},null,null,null,null,null,null,null,null,null,null,null,null,null,null,"",null,null,"",null,null,"",null,null,null,null,null,"",null,null,null,null,null,null,null,"",null,null,null,null,null,null,null,"",null,null,null,null,"",null,"","","","","","","","",""]
[null,null,null,{"$f":"IF(D46=\"\",\"\",D46)","v":""},{"$f":"IF(E46=\"\",\"\",E46)","v":""},null,null,null,null,null,null,null,null,null,null,null,null,null,null,"",null,null,"",null,null,"",null,null,null,null,null,"",null,null,null,null,null,null,null,"",null,null,null,null,null,null,null,"",null,null,null,null,"",null,"","","","","","","","",""]
[null,null,null,{"$f":"IF(D47=\"\",\"\",D47)","v":""},{"$f":"IF(E47=\"\",\"\",E47)","v":""},null,null,null,null,null,null,null,null,null,null,null,null,null,null,"",null,null,"",null,null,"",null,null,null,null,null,"",null,null,null,null,null,null,null,"",null,null,null,null,null,null,null,"",null,null,null,null,"",null,"","","","","","","","",""]
[null,null,null,{"$f":"IF(D48=\"\",\"\",D48)","v":""},{"$f":"IF(E48=\"\",\"\",E48)","v":""},null,null,null,null,null,null,null,null,null,null,null,null,null,null,"",null,null,"",null,null,"",null,null,null,null,null,"",null,null,null,null,null,null,null,"",null,null,null,null,null,null,null,"",null,null,null,null,"",null,"","","","","","","","",""]
[null,null,null,{"$f":"IF(D49=\"\",\"\",D49)","v":""},{"$f":"IF(E49=\"\",\"\",E49)","v":""},null,null,null,null,null,null,null,null,null,null,null,null,null,null,"",null,null,"",null,null,"",null,null,null,null,null,"",null,null,null,null,null,null,null,"",null,null,null,null,null,null,null,"",null,null,null,null,"",null,"","","","","","","","",""]
[null,null,null,{"$f":"IF(D50=\"\",\"\",D50)","v":""},{"$f":"IF(E50=\"\",\"\",E50)","v":""},null,null,null,null,null,null,null,null,null,null,null,null,null,null,"",null,null,"",null,null,"",null,null,null,null,null,"",null,null,null,null,null,null,null,"",null,null,null,null,null,null,null,"",null,null,null,null,"",null,"","","","","","","","",""]
[null,null,null,{"$f":"IF(D51=\"\",\"\",D51)","v":""},{"$f":"IF(E51=\"\",\"\",E51)","v":""},null,null,null,null,null,null,null,null,null,null,null,null,null,null,"",null,null,"",null,null,"",null,null,null,null,null,"",null,null,null,null,null,null,null,"",null,null,null,null,null,null,null,"",null,null,null,null,"",null,"","","","","","","","",""]
[null,null,null,{"$f":"IF(D52=\"\",\"\",D52)","v":""},{"$f":"IF(E52=\"\",\"\",E52)","v":""},null,null,null,null,null,null,null,null,null,null,null,null,null,null,"",null,null,"",null,null,"",null,null,null,null,null,"",null,null,null,null,null,null,null,"",null,null,null,null,null,null,null,"",null,null,null,null,"",null,"","","","","","","","",""]
[null,null,null,{"$f":"IF(D53=\"\",\"\",D53)","v":""},{"$f":"IF(E53=\"\",\"\",E53)","v":""},null,null,null,null,null,null,null,null,null,null,null,null,null,null,"",null,null,"",null,null,"",null,null,null,null,null,"",null,null,null,null,null,null,null,"",null,null,null,null,null,null,null,"",null,null,null,null,"",null,"","","","","","","","",""]
[null,null,null,{"$f":"IF(D54=\"\",\"\",D54)","v":""},{"$f":"IF(E54=\"\",\"\",E54)","v":""},null,null,null,null,null,null,null,null,null,null,null,null,null,null,"",null,null,"",null,null,"",null,null,null,null,null,"",null,null,null,null,null,null,null,"",null,null,null,null,null,null,null,"",null,null,null,null,"",null,"","","","","","","","",""]
[null,null,null,{"$f":"IF(D55=\"\",\"\",D55)","v":""},{"$f":"IF(E55=\"\",\"\",E55)","v":""},null,null,null,null,null,null,null,null,null,null,null,null,null,null,"",null,null,"",null,null,"",null,null,null,null,null,"",null,null,null,null,null,null,null,"",null,null,null,null,null,null,null,"",null,null,null,null,"",null,"","","","","","","","",""]
[null,null,null,{"$f":"IF(D56=\"\",\"\",D56)","v":""},{"$f":"IF(E56=\"\",\"\",E56)","v":""},null,null,null,null,null,null,null,null,null,null,null,null,null,null,"",null,null,"",null,null,"",null,null,null,null,null,"",null,null,null,null,null,null,null,"",null,null,null,null,null,null,null,"",null,null,null,null,"",null,"","","","","","","","",""]
[null,null,null,{"$f":"IF(D57=\"\",\"\",D57)","v":""},{"$f":"IF(E57=\"\",\"\",E57)","v":""},null,null,null,null,null,null,null,null,null,null,null,null,null,null,"",null,null,"",null,null,"",null,null,null,null,null,"",null,null,null,null,null,null,null,"",null,null,null,null,null,null,null,"",null,null,null,null,"",null,"","","","","","","","",""]
[null,null,null,{"$f":"IF(D58=\"\",\"\",D58)","v":""},{"$f":"IF(E58=\"\",\"\",E58)","v":""},null,null,null,null,null,null,null,null,null,null,null,null,null,null,"",null,null,"",null,null,"",null,null,null,null,null,"",null,null,null,null,null,null,null,"",null,null,null,null,null,null,null,"",null,null,null,null,"",null,"","","","","","","","",""]
[null,null,null,{"$f":"IF(D59=\"\",\"\",D59)","v":""},{"$f":"IF(E59=\"\",\"\",E59)","v":""},null,null,null,null,null,null,null,null,null,null,null,null,null,null,"",null,null,"",null,null,"",null,null,null,null,null,"",null,null,null,null,null,null,null,"",null,null,null,null,null,null,null,"",null,null,null,null,"",null,"","","","","","","","",""]
[null,null,null,{"$f":"IF(D60=\"\",\"\",D60)","v":""},"",null,null,null,null,null,null,null,null,null,null,null,null,null,null,"",null,null,"",null,null,"",null,null,null,null,null,"",null,null,null,null,null,null,null,"",null,null,null,null,null,null,null,"",null,null,null,null,"",null,"","","","","","","","",""]
[null,null,null,{"$f":"IF(D61=\"\",\"\",D61)","v":""},"",null,null,null,null,null,null,null,null,null,null,null,null,null,null,"",null,null,"",null,null,"",null,null,null,null,null,"",null,null,null,null,null,null,null,"",null,null,null,null,null,null,null,"",null,null,null,null,"",null,"","","","","","","","",""]
[null,null,null,{"$f":"IF(D62=\"\",\"\",D62)","v":""},"",null,null,null,null,null,null,null,null,null,null,null,null,null,null,"",null,null,"",null,null,"",null,null,null,null,null,"",null,null,null,null,null,null,null,"",null,null,null,null,null,null,null,"",null,null,null,null,"",null,"","","","","","","","",""]
[null,null,null,{"$f":"IF(D63=\"\",\"\",D63)","v":""},"",null,null,null,null,null,null,null,null,null,null,null,null,null,null,"",null,null,"",null,null,"",null,null,null,null,null,"",null,null,null,null,null,null,null,"",null,null,null,null,null,null,null,"",null,null,null,null,"",null,"","","","","","","","",""]
[null,null,null,{"$f":"IF(D64=\"\",\"\",D64)","v":""},"",null,null,null,null,null,null,null,null,null,null,null,null,null,null,"",null,null,"",null,null,"",null,null,null,null,null,"",null,null,null,null,null,null,null,"",null,null,null,null,null,null,null,"",null,null,null,null,"",null,"","","","","","","","",""]
[null,null,null,{"$f":"IF(D65=\"\",\"\",D65)","v":""},"",null,null,null,null,null,null,null,null,null,null,null,null,null,null,"",null,null,"",null,null,"",null,null,null,null,null,"",null,null,null,null,null,null,null,"",null,null,null,null,null,null,null,"",null,null,null,null,"",null,"","","","","","","","",""]
[null,null,null,{"$f":"IF(D66=\"\",\"\",D66)","v":""},"",null,null,null,null,null,null,null,null,null,null,null,null,null,null,"",null,null,"",null,null,"",null,null,null,null,null,"",null,null,null,null,null,null,null,"",null,null,null,null,null,null,null,"",null,null,null,null,"",null,"","","","","","","","",""]
[null,null,null,{"$f":"IF(D67=\"\",\"\",D67)","v":""},"",null,null,null,null,null,null,null,null,null,null,null,null,null,null,"",null,null,"",null,null,"",null,null,null,null,null,"",null,null,null,null,null,null,null,"",null,null,null,null,null,null,null,"",null,null,null,null,"",null,"","","","","","","","",""]
[null,null,null,{"$f":"IF(D68=\"\",\"\",D68)","v":""},"",null,null,null,null,null,null,null,null,null,null,null,null,null,null,"",null,null,"",null,null,"",null,null,null,null,null,"",null,null,null,null,null,null,null,"",null,null,null,null,null,null,null,"",null,null,null,null,"",null,"","","","","","","","",""]
[null,null,null,{"$f":"IF(D69=\"\",\"\",D69)","v":""},{"$f":"IF(E69=\"\",\"\",E69)","v":""},null,null,null,null,null,null,null,null,null,null,null,null,null,null,"",null,null,"",null,null,"",null,null,null,null,null,"",null,null,null,null,null,null,null,"",null,null,null,null,null,null,null,"",null,null,null,null,"",null,"","","","","","","","",""]
[null,null,null,{"$f":"IF(D70=\"\",\"\",D70)","v":""},{"$f":"IF(E70=\"\",\"\",E70)","v":""},null,null,null,null,null,null,null,null,null,null,null,null,null,null,"",null,null,"",null,null,"",null,null,null,null,null,"",null,null,null,null,null,null,null,"",null,null,null,null,null,null,null,"",null,null,null,null,"",null,"","","","","","","","",""]
[null,null,null,{"$f":"IF(D71=\"\",\"\",D71)","v":""},{"$f":"IF(E71=\"\",\"\",E71)","v":""},null,null,null,null,null,null,null,null,null,null,null,null,null,null,"",null,null,"",null,null,"",null,null,null,null,null,"",null,null,null,null,null,null,null,"",null,null,null,null,null,null,null,"",null,null,null,null,"",null,"","","","","","","","",""]
[null,null,null,{"$f":"IF(D72=\"\",\"\",D72)","v":""},{"$f":"IF(E72=\"\",\"\",E72)","v":""},null,null,null,null,null,null,null,null,null,null,null,null,null,null,"",null,null,"",null,null,"",null,null,null,null,null,"",null,null,null,null,null,null,null,"",null,null,null,null,null,null,null,"",null,null,null,null,"",null,"","","","","","","","",""]
[null,null,null,{"$f":"IF(D73=\"\",\"\",D73)","v":""},{"$f":"IF(E73=\"\",\"\",E73)","v":""},null,null,null,null,null,null,null,null,null,null,null,null,null,null,"",null,null,"",null,null,"",null,null,null,null,null,"",null,null,null,null,null,null,null,"",null,null,null,null,null,null,null,"",null,null,null,null,"",null,"","","","","","","","",""]
[null,null,null,{"$f":"IF(D74=\"\",\"\",D74)","v":""},{"$f":"IF(E74=\"\",\"\",E74)","v":""},null,null,null,null,null,null,null,null,null,null,null,null,null,null,"",null,null,"",null,null,"",null,null,null,null,null,"",null,null,null,null,null,null,null,"",null,null,null,null,null,null,null,"",null,null,null,null,"",null,"","","","","","","","",""]
[null,null,null,{"$f":"IF(D75=\"\",\"\",D75)","v":""},{"$f":"IF(E75=\"\",\"\",E75)","v":""},null,null,null,null,null,null,null,null,null,null,null,null,null,null,"",null,null,"",null,null,"",null,null,null,null,null,"",null,null,null,null,null,null,null,"",null,null,null,null,null,null,null,"",null,null,null,null,"",null,"","","","","","","","",""]
[null,null,null,{"$f":"IF(D76=\"\",\"\",D76)","v":""},{"$f":"IF(E76=\"\",\"\",E76)","v":""},null,null,null,null,null,null,null,null,null,null,null,null,null,null,"",null,null,"",null,null,"",null,null,null,null,null,"",null,null,null,null,null,null,null,"",null,null,null,null,null,null,null,"",null,null,null,null,"",null,"","","","","","","","",""]
[null,null,null,{"$f":"IF(D77=\"\",\"\",D77)","v":""},{"$f":"IF(E77=\"\",\"\",E77)","v":""},null,null,null,null,null,null,null,null,null,null,null,null,null,null,"",null,null,"",null,null,"",null,null,null,null,null,"",null,null,null,null,null,null,null,"",null,null,null,null,null,null,null,"",null,null,null,null,"",null,"","","","","","","","",""]
[null,null,null,{"$f":"IF(D78=\"\",\"\",D78)","v":""},{"$f":"IF(E78=\"\",\"\",E78)","v":""},null,null,null,null,null,null,null,null,null,null,null,null,null,null,"",null,null,"",null,null,"",null,null,null,null,null,"",null,null,null,null,null,null,null,"",null,null,null,null,null,null,null,"",null,null,null,null,"",null,"","","","","","","","",""]
[null,null,null,{"$f":"IF(D79=\"\",\"\",D79)","v":""},{"$f":"IF(E79=\"\",\"\",E79)","v":""},null,null,null,null,null,null,null,null,null,null,null,null,null,null,"",null,null,"",null,null,"",null,null,null,null,null,"",null,null,null,null,null,null,null,"",null,null,null,null,null,null,null,"",null,null,null,null,"",null,"","","","","","","","",""]
[null,null,null,{"$f":"IF(D80=\"\",\"\",D80)","v":""},{"$f":"IF(E80=\"\",\"\",E80)","v":""},null,null,null,null,null,null,null,null,null,null,null,null,null,null,"",null,null,"",null,null,"",null,null,null,null,null,"",null,null,null,null,null,null,null,"",null,null,null,null,null,null,null,"",null,null,null,null,"",null,"","","","","","","","",""]
[null,null,null,{"$f":"IF(D81=\"\",\"\",D81)","v":""},{"$f":"IF(E81=\"\",\"\",E81)","v":""},null,null,null,null,null,null,null,null,null,null,null,null,null,null,"",null,null,"",null,null,"",null,null,null,null,null,"",null,null,null,null,null,null,null,"",null,null,null,null,null,null,null,"",null,null,null,null,"",null,"","","","","","","","",""]
[null,null,null,{"$f":"IF(D82=\"\",\"\",D82)","v":""},{"$f":"IF(E82=\"\",\"\",E82)","v":""},null,null,null,null,null,null,null,null,null,null,null,null,null,null,"",null,null,"",null,null,"",null,null,null,null,null,"",null,null,null,null,null,null,null,"",null,null,null,null,null,null,null,"",null,null,null,null,"",null,"","","","","","","","",""]
[null,null,null,{"$f":"IF(D83=\"\",\"\",D83)","v":""},{"$f":"IF(E83=\"\",\"\",E83)","v":""},null,null,null,null,null,null,null,null,null,null,null,null,null,null,"",null,null,"",null,null,"",null,null,null,null,null,"",null,null,null,null,null,null,null,"",null,null,null,null,null,null,null,"",null,null,null,null,"",null,"","","","","","","","",""]
[null,null,null,{"$f":"IF(D84=\"\",\"\",D84)","v":""},{"$f":"IF(E84=\"\",\"\",E84)","v":""},null,null,null,null,null,null,null,null,null,null,null,null,null,null,"",null,null,"",null,null,"",null,null,null,null,null,"",null,null,null,null,null,null,null,"",null,null,null,null,null,null,null,"",null,null,null,null,"",null,"","","","","","","","",""]
[null,null,null,{"$f":"IF(D85=\"\",\"\",D85)","v":""},{"$f":"IF(E85=\"\",\"\",E85)","v":""},null,null,null,null,null,null,null,null,null,null,null,null,null,null,"",null,null,"",null,null,"",null,null,null,null,null,"",null,null,null,null,null,null,null,"",null,null,null,null,null,null,null,"",null,null,null,null,"",null,"","","","","","","","",""]
[null,null,null,{"$f":"IF(D86=\"\",\"\",D86)","v":""},{"$f":"IF(E86=\"\",\"\",E86)","v":""},null,null,null,null,null,null,null,null,null,null,null,null,null,null,"",null,null,"",null,null,"",null,null,null,null,null,"",null,null,null,null,null,null,null,"",null,null,null,null,null,null,null,"",null,null,null,null,"",null,"","","","","","","","",""]
[null,null,null,{"$f":"IF(D87=\"\",\"\",D87)","v":""},{"$f":"IF(E87=\"\",\"\",E87)","v":""},null,null,null,null,null,null,null,null,null,null,null,null,null,null,"",null,null,"",null,null,"",null,null,null,null,null,"",null,null,null,null,null,null,null,"",null,null,null,null,null,null,null,"",null,null,null,null,"",null,"","","","","","","","",""]
[null,null,null,{"$f":"IF(D88=\"\",\"\",D88)","v":""},{"$f":"IF(E88=\"\",\"\",E88)","v":""},null,null,null,null,null,null,null,null,null,null,null,null,null,null,"",null,null,"",null,null,"",null,null,null,null,null,"",null,null,null,null,null,null,null,"",null,null,null,null,null,null,null,"",null,null,null,null,"",null,"","","","","","","","",""]
[null,null,null,{"$f":"IF(D89=\"\",\"\",D89)","v":""},{"$f":"IF(E89=\"\",\"\",E89)","v":""},null,null,null,null,null,null,null,null,null,null,null,null,null,null,"",null,null,"",null,null,"",null,null,null,null,null,"",null,null,null,null,null,null,null,"",null,null,null,null,null,null,null,"",null,null,null,null,"",null,{"$f":"IF(Z156=20,(AF156*20/100),\"\")","v":""},"","","","","","","",""]
[null,null,null,"TOPLAM",null,null,null,null,null,null,null,null,null,null,null,null,null,null,null,null,null,null,null,null,null,null,null,{"$f":"SUM(AB97:AB156)","v":12000},null,null,null,{"$f":"SUM(AF97:AF156)","v":24000},null,null,null,{"$f":"SUM(AJ97:AJ156)","v":15000},null,null,null,{"$f":"SUM(AN97:AN156)","v":30000},null,null,null,{"$f":"SUM(AR97:AR156)","v":18000},null,null,null,{"$f":"SUM(AV97:AV156)","v":36000},null,null,null,null,null,null,{"$f":"SUM(BC97:BC156)","v":1200},{"$f":"SUM(BD97:BD156)","v":800},100,1600,1000,120,2000,1200,140]
[]
[null,null,null,"EN UYGUN (DÜŞÜK) TEKLİFİ VEREN KİŞİ/FİRMA"]
[null,null,null,"ADI",null,null,null,null,null,null,null,null,null,null,null,null,null,null,null,"ADRESİ",null,null,null,null,null,null,null,null,null,null,null,"TEKLİFİ",null,null,null,"KDV (%20)",null,null,null,"KDV (%10)",null,null,null,"KDV (%1)",null,null,null,"TOPLAM"]
[null,null,null,{"$f":"IF(AND(AF157<AN157,AF157<AV157),AB95,(IF(AND(AN157<AF157,AN157<AV157),AJ95,(IF(AND(AV157<AF157,AV157<AN157),AR95,\"\")))))","v":"A GERÇEK/TÜZEL KİŞİSİ"},null,null,null,null,null,null,null,null,null,null,null,null,null,null,null,"Bulanık/MUŞ",null,null,null,null,null,null,null,null,null,null,null,{"$f":"IF(D161=AB95,AF157,IF(D161=AJ95,AN157,IF(D161=AR95,AV157,\"\")))","v":24000},null,null,null,{"$f":"IF(D161=AB95,BC157,IF(D161=AJ95,BF157,IF(D161=AR95,BI157,\"\")))","v":1200},null,null,null,{"$f":"IF(D161=AB95,BD157,IF(D161=AJ95,BG157,IF(D161=AR95,BJ157,\"\")))","v":800},null,null,null,{"$f":"IF(D161=AB95,BE157,IF(D161=AJ95,BH157,IF(D161=AR95,BK157,\"\")))","v":100},null,null,null,{"$f":"IF(D161=\"\",\"\",(AF161+AJ161+AN161+AR161))","v":26100}]
[]
[null,null,null,null,null,null,null,null,null,null,null,null,null,null,null,null,null,null,null,null,null,"Birim Fiyat Teklif Mektuplarına Şartlar Eklenecekse Aşağıdaki Alanlara Şartlar Girilecektir.  Aksi durumda silinmelidir."]
[]
[null,null,null,"     İDARİ ŞARTLAR"]
[null,null,null,{"$f":"IF(E166=\"\",\"\",1)","v":1},"Bu bent boş bırakılmıştır."]
[null,null,null,{"$f":"IF(E167=\"\",\"\",2)","v":""}]
[null,null,null,{"$f":"IF(E168=\"\",\"\",3)","v":""}]
[null,null,null,{"$f":"IF(E169=\"\",\"\",4)","v":""}]
[null,null,null,{"$f":"IF(E170=\"\",\"\",5)","v":""}]
[null,null,null,{"$f":"IF(E171=\"\",\"\",6)","v":""}]
[null,null,null,{"$f":"IF(E172=\"\",\"\",7)","v":""}]
[null,null,null,{"$f":"IF(E173=\"\",\"\",8)","v":""}]
[null,null,null,{"$f":"IF(E174=\"\",\"\",9)","v":""}]
[null,null,null,{"$f":"IF(E175=\"\",\"\",10)","v":""}]
[null,null,null,{"$f":"IF(E176=\"\",\"\",11)","v":""}]
[null,null,null,{"$f":"IF(E177=\"\",\"\",12)","v":""}]
[null,null,null,{"$f":"IF(E178=\"\",\"\",13)","v":""}]
[null,null,null,{"$f":"IF(E179=\"\",\"\",14)","v":""}]
[null,null,null,{"$f":"IF(E180=\"\",\"\",15)","v":""}]
[]
[null,null,null,"    TEKNİK ŞARTLAR"]
[null,null,null,{"$f":"IF(E183=\"\",\"\",1)","v":1},"Bu bent boş bırakılmıştır."]
[null,null,null,{"$f":"IF(E184=\"\",\"\",D183+1)","v":""}]
[null,null,null,{"$f":"IF(E185=\"\",\"\",3)","v":""}]
[null,null,null,{"$f":"IF(E186=\"\",\"\",4)","v":""}]
[null,null,null,{"$f":"IF(E187=\"\",\"\",5)","v":""}]
[null,null,null,{"$f":"IF(E188=\"\",\"\",6)","v":""}]
[null,null,null,{"$f":"IF(E189=\"\",\"\",7)","v":""}]
[null,null,null,{"$f":"IF(E190=\"\",\"\",8)","v":""}]
[null,null,null,{"$f":"IF(E191=\"\",\"\",9)","v":""}]
[null,null,null,{"$f":"IF(E192=\"\",\"\",10)","v":""}]
[null,null,null,{"$f":"IF(E193=\"\",\"\",11)","v":""}]
[null,null,null,{"$f":"IF(E194=\"\",\"\",12)","v":""}]
[null,null,null,{"$f":"IF(E195=\"\",\"\",13)","v":""}]
[null,null,null,{"$f":"IF(E196=\"\",\"\",14)","v":""}]
[null,null,null,{"$f":"IF(E197=\"\",\"\",15)","v":""}]
[null,null,null,{"$f":"IF(E198=\"\",\"\",16)","v":""}]
[null,null,null,{"$f":"IF(E199=\"\",\"\",17)","v":""}]
[null,null,null,{"$f":"IF(E200=\"\",\"\",18)","v":""}]
[null,null,null,{"$f":"IF(E201=\"\",\"\",19)","v":""}]
[null,null,null,{"$f":"IF(E202=\"\",\"\",20)","v":""}]

{"sheet":"1","index":2,"n_rows":99,"n_cols":28,"rows_kept":99,"cut":false,"hidden":false,"merged":[[88,1,88,22],[88,23,88,26],[88,27,88,30],[89,1,89,22],[89,23,89,26],[89,27,89,30],[85,1,85,22],[85,23,85,26],[85,27,85,30],[86,1,86,22],[86,23,86,26],[86,27,86,30],[87,1,87,22],[87,23,87,26],[87,27,87,30],[82,1,82,22],[82,23,82,26],[82,27,82,30],[83,1,83,22],[83,23,83,26],[83,27,83,30],[84,1,84,22],[84,23,84,26],[84,27,84,30],[79,1,79,22],[79,23,79,26],[79,27,79,30],[80,1,80,22],[80,23,80,26],[80,27,80,30],[81,1,81,22],[81,23,81,26],[81,27,81,30],[75,27,75,30],[76,1,76,22],[76,23,76,26],[76,27,76,30],[77,1,77,22],[77,23,77,26],[77,27,77,30],[78,1,78,22],[78,23,78,26],[78,27,78,30],[93,21,93,30],[93,10,93,20],[93,0,93,9],[92,0,92,30],[90,27,90,30],[90,23,90,26],[90,1,90,22],[70,1,70,22],[70,23,70,26],[70,27,70,30],[71,1,71,22],[71,23,71,26],[71,27,71,30],[72,1,72,22],[72,23,72,26],[72,27,72,30],[73,1,73,22],[73,23,73,26],[73,27,73,30],[74,1,74,22],[74,23,74,26],[74,27,74,30],[75,1,75,22],[75,23,75,26],[97,21,97,30],[97,10,97,20],[97,0,97,9],[98,21,98,30],[98,10,98,20],[98,0,98,9],[96,0,96,30],[94,21,94,30],[94,10,94,20],[94,0,94,9],[63,1,63,22],[64,1,64,22],[52,23,52,26],[48,1,48,22],[48,23,48,26],[48,27,48,30],[49,1,49,22],[49,23,49,26],[49,27,49,30],[50,1,50,22],[51,1,51,22],[52,1,52,22],[53,1,53,22],[54,1,54,22],[55,1,55,22],[56,1,56,22],[57,1,57,22],[58,1,58,22],[59,1,59,22],[53,23,53,26],[53,27,53,30],[54,23,54,26],[54,27,54,30],[55,23,55,26],[68,1,68,22],[69,1,69,22],[60,1,60,22],[61,1,61,22],[62,1,62,22],[45,1,45,22],[45,23,45,26],[45,27,45,30],[46,1,46,22],[46,23,46,26],[46,27,46,30],[47,1,47,22],[47,23,47,26],[47,27,47,30],[52,27,52,30],[65,1,65,22],[66,1,66,22],[67,1,67,22],[56,23,56,26],[56,27,56,30],[57,23,57,26],[57,27,57,30],[58,23,58,26],[58,27,58,30],[42,1,42,22],[42,23,42,26],[42,27,42,30],[43,1,43,22],[43,23,43,26],[43,27,43,30],[44,1,44,22],[44,23,44,26],[44,27,44,30],[39,1,39,22],[39,23,39,26],[39,27,39,30],[40,1,40,22],[40,23,40,26],[40,27,40,30],[41,1,41,22],[41,23,41,26],[41,27,41,30],[35,23,35,26],[35,27,35,30],[36,1,36,22],[36,23,36,26],[36,27,36,30],[37,1,37,22],[37,23,37,26],[37,27,37,30],[38,1,38,22],[38,23,38,26],[38,27,38,30],[18,19,18,30],[1,0,1,30],[2,0,2,30],[3,0,3,30],[5,0,5,2],[5,4,5,19],[5,24,5,30],[6,0,6,2],[6,4,6,26],[9,0,9,30],[11,0,15,30],[17,19,17,30],[21,9,21,21],[23,9,23,21],[29,0,29,30],[30,1,30,22],[30,23,30,26],[50,23,50,26],[50,27,50,30],[51,23,51,26],[51,27,51,30],[30,27,30,30],[22,9,22,21],[31,1,31,22],[31,27,31,30],[31,23,31,26],[32,1,32,22],[32,27,32,30],[32,23,32,26],[33,1,33,22],[33,27,33,30],[33,23,33,26],[34,1,34,22],[34,23,34,26],[34,27,34,30],[35,1,35,22],[55,27,55,30],[62,23,62,26],[62,27,62,30],[63,23,63,26],[63,27,63,30],[64,23,64,26],[64,27,64,30],[59,23,59,26],[59,27,59,30],[60,23,60,26],[60,27,60,30],[61,23,61,26],[61,27,61,30],[68,23,68,26],[68,27,68,30],[69,23,69,26],[69,27,69,30],[65,23,65,26],[65,27,65,30],[66,23,66,26],[66,27,66,30],[67,23,67,26],[67,27,67,30]]}
[]
["T.C."]
[{"$f":"IF('BİLGİ GİRİŞİ'!O7=\"\",\"\",'BİLGİ GİRİŞİ'!O7)","v":"BULANIK KAYMAKAMLIĞI"}]
[{"$f":"IF('BİLGİ GİRİŞİ'!O8=\"\",\"\",'BİLGİ GİRİŞİ'!O8)","v":"Atatürk İlkokulu Müdürlüğü"}]
[]
["Sayı",null,null,":",{"$f":"IF('BİLGİ GİRİŞİ'!S15=\"\",\"\",'BİLGİ GİRİŞİ'!S15)","v":456789123},null,null,null,null,null,null,null,null,null,null,null,null,null,null,null,null,null,null,null,{"$f":"IF('BİLGİ GİRİŞİ'!O15=\"\",\"…../…../……..\",'BİLGİ GİRİŞİ'!O15)","v":"2023-03-06"}]
["Konu",null,null,":","Mal Alımı/Hizmet Alımı/Yapım İşi"]
[]
[]
[{"$f":"IF('BİLGİ GİRİŞİ'!O8=\"\",\"\",CONCATENATE(UPPER('BİLGİ GİRİŞİ'!O8),\" \nHARCAMA YETKİLİSİ MAKAMINA\",))","v":"ATATÜRK İLKOKULU MÜDÜRLÜĞÜ \nHARCAMA YETKİLİSİ MAKAMINA"}]
[]
[{"$f":"CONCATENATE(\"       \",\"Kurumumuz ihtiyaçlarında kullanılmak üzere aşağıda bilgileri verilen  Mal'ın/Hizmet'in/Yapım İşi'nin Kamu İhale Kanunu'nun \",IF('BİLGİ GİRİŞİ'!O10=\"\",\".............................................................................\",'BİLGİ GİRİŞİ'!O10),\" Maddesine göre Doğrudan Temin yoluyla satın alınması ve aşağıda bilgileri verilen personellerin piyasa araştırma , muayene ve kabul görevlisi olarak görevlendirilmesi hususunu;\n       Olurlarınıza arz ederim/ederiz.\")","v":"       Kurumumuz ihtiyaçlarında kullanılmak üzere aşağıda bilgileri verilen  Mal'ın/Hizmet'in/Yapım İşi'nin Kamu İhale Kanunu'nun 22/d Maddesine göre Doğrudan Temin yoluyla satın alınması ve aşağıda bilgileri verilen personellerin piyasa araştırma , muayene ve kabul görevlisi olarak görevlendirilmesi hususunu;\n       Olurlarınıza arz ederim/ederiz."}]
[]
[]
[]
[]
[]
[null,null,null,null,null,null,null,null,null,null,null,null,null,null,null,null,null,null,null,{"$f":"IF('BİLGİ GİRİŞİ'!AB17=\"\",\"\",'BİLGİ GİRİŞİ'!AB17)","v":"Ahmet DEMİR"}]
[null,null,null,null,null,null,null,null,null,null,null,null,null,null,null,null,null,null,null,{"$f":"IF(T18=\"\",\"\",IF('BİLGİ GİRİŞİ'!AB18=\"\",\"\",'BİLGİ GİRİŞİ'!AB18))","v":"Müdür Yardımcısı 1"}]
[]
[]
[null,null,null,null,null,null,null,null,null,{"$f":"IF(J23=\"\",\"\",IF('BİLGİ GİRİŞİ'!AT16=\"\",\"\",'BİLGİ GİRİŞİ'!AT16))","v":"OLUR/UYGUNDUR"}]
[null,null,null,null,null,null,null,null,null,{"$f":"IF('BİLGİ GİRİŞİ'!AT17=\"\",\"\",'BİLGİ GİRİŞİ'!AT17)","v":"Mustafa AYDIN"}]
[null,null,null,null,null,null,null,null,null,{"$f":"IF(J23=\"\",\"\",IF('BİLGİ GİRİŞİ'!AT18=\"\",\"\",'BİLGİ GİRİŞİ'!AT18))","v":"Okul Müdürü"}]
[]
[]
[]
[]
[]
["MAL'IN/HİZMET'İN/YAPIM İŞİ'NİN"]
["S","Kalem/KısımBilgileri",null,null,null,null,null,null,null,null,null,null,null,null,null,null,null,null,null,null,null,null,null,"Birimi",null,null,null,"Miktarı"]
[{"$f":"IF('BİLGİ GİRİŞİ'!D30=\"\",\"\",'BİLGİ GİRİŞİ'!D30)","v":1},{"$f":"IF('BİLGİ GİRİŞİ'!E30=\"\",\"\",'BİLGİ GİRİŞİ'!E30)","v":"AIO (All In One) Masaüstü Bilgisayar "},null,null,null,null,null,null,null,null,null,null,null,null,null,null,null,null,null,null,null,null,null,{"$f":"IF('BİLGİ GİRİŞİ'!W30=\"\",\"\",'BİLGİ GİRİŞİ'!W30)","v":"Adet"},null,null,null,{"$f":"IF('BİLGİ GİRİŞİ'!T30=\"\",\"\",'BİLGİ GİRİŞİ'!T30)","v":2}]
[{"$f":"IF('BİLGİ GİRİŞİ'!D31=\"\",\"\",'BİLGİ GİRİŞİ'!D31)","v":2},{"$f":"IF('BİLGİ GİRİŞİ'!E31=\"\",\"\",'BİLGİ GİRİŞİ'!E31)","v":"Fotokopi Makinesi"},null,null,null,null,null,null,null,null,null,null,null,null,null,null,null,null,null,null,null,null,null,{"$f":"IF('BİLGİ GİRİŞİ'!W31=\"\",\"\",'BİLGİ GİRİŞİ'!W31)","v":"Adet"},null,null,null,{"$f":"IF('BİLGİ GİRİŞİ'!T31=\"\",\"\",'BİLGİ GİRİŞİ'!T31)","v":2}]
[{"$f":"IF('BİLGİ GİRİŞİ'!D32=\"\",\"\",'BİLGİ GİRİŞİ'!D32)","v":3},{"$f":"IF('BİLGİ GİRİŞİ'!E32=\"\",\"\",'BİLGİ GİRİŞİ'!E32)","v":"Projektör"},null,null,null,null,null,null,null,null,null,null,null,null,null,null,null,null,null,null,null,null,null,{"$f":"IF('BİLGİ GİRİŞİ'!W32=\"\",\"\",'BİLGİ GİRİŞİ'!W32)","v":"Adet"},null,null,null,{"$f":"IF('BİLGİ GİRİŞİ'!T32=\"\",\"\",'BİLGİ GİRİŞİ'!T32)","v":2}]
[{"$f":"IF('BİLGİ GİRİŞİ'!D33=\"\",\"\",'BİLGİ GİRİŞİ'!D33)","v":""},{"$f":"IF('BİLGİ GİRİŞİ'!E33=\"\",\"\",'BİLGİ GİRİŞİ'!E33)","v":""},null,null,null,null,null,null,null,null,null,null,null,null,null,null,null,null,null,null,null,null,null,{"$f":"IF('BİLGİ GİRİŞİ'!W33=\"\",\"\",'BİLGİ GİRİŞİ'!W33)","v":""},null,null,null,{"$f":"IF('BİLGİ GİRİŞİ'!T33=\"\",\"\",'BİLGİ GİRİŞİ'!T33)","v":""}]
[{"$f":"IF('BİLGİ GİRİŞİ'!D34=\"\",\"\",'BİLGİ GİRİŞİ'!D34)","v":""},{"$f":"IF('BİLGİ GİRİŞİ'!E34=\"\",\"\",'BİLGİ GİRİŞİ'!E34)","v":""},null,null,null,null,null,null,null,null,null,null,null,null,null,null,null,null,null,null,null,null,null,{"$f":"IF('BİLGİ GİRİŞİ'!W34=\"\",\"\",'BİLGİ GİRİŞİ'!W34)","v":""},null,null,null,{"$f":"IF('BİLGİ GİRİŞİ'!T34=\"\",\"\",'BİLGİ GİRİŞİ'!T34)","v":""}]
[{"$f":"IF('BİLGİ GİRİŞİ'!D35=\"\",\"\",'BİLGİ GİRİŞİ'!D35)","v":""},{"$f":"IF('BİLGİ GİRİŞİ'!E35=\"\",\"\",'BİLGİ GİRİŞİ'!E35)","v":""},null,null,null,null,null,null,null,null,null,null,null,null,null,null,null,null,null,null,null,null,null,{"$f":"IF('BİLGİ GİRİŞİ'!W35=\"\",\"\",'BİLGİ GİRİŞİ'!W35)","v":""},null,null,null,{"$f":"IF('BİLGİ GİRİŞİ'!T35=\"\",\"\",'BİLGİ GİRİŞİ'!T35)","v":""}]
[{"$f":"IF('BİLGİ GİRİŞİ'!D36=\"\",\"\",'BİLGİ GİRİŞİ'!D36)","v":""},{"$f":"IF('BİLGİ GİRİŞİ'!E36=\"\",\"\",'BİLGİ GİRİŞİ'!E36)","v":""},null,null,null,null,null,null,null,null,null,null,null,null,null,null,null,null,null,null,null,null,null,{"$f":"IF('BİLGİ GİRİŞİ'!W36=\"\",\"\",'BİLGİ GİRİŞİ'!W36)","v":""},null,null,null,{"$f":"IF('BİLGİ GİRİŞİ'!T36=\"\",\"\",'BİLGİ GİRİŞİ'!T36)","v":""}]
[{"$f":"IF('BİLGİ GİRİŞİ'!D37=\"\",\"\",'BİLGİ GİRİŞİ'!D37)","v":""},{"$f":"IF('BİLGİ GİRİŞİ'!E37=\"\",\"\",'BİLGİ GİRİŞİ'!E37)","v":""},null,null,null,null,null,null,null,null,null,null,null,null,null,null,null,null,null,null,null,null,null,{"$f":"IF('BİLGİ GİRİŞİ'!W37=\"\",\"\",'BİLGİ GİRİŞİ'!W37)","v":""},null,null,null,{"$f":"IF('BİLGİ GİRİŞİ'!T37=\"\",\"\",'BİLGİ GİRİŞİ'!T37)","v":""}]
[{"$f":"IF('BİLGİ GİRİŞİ'!D38=\"\",\"\",'BİLGİ GİRİŞİ'!D38)","v":""},{"$f":"IF('BİLGİ GİRİŞİ'!E38=\"\",\"\",'BİLGİ GİRİŞİ'!E38)","v":""},null,null,null,null,null,null,null,null,null,null,null,null,null,null,null,null,null,null,null,null,null,{"$f":"IF('BİLGİ GİRİŞİ'!W38=\"\",\"\",'BİLGİ GİRİŞİ'!W38)","v":""},null,null,null,{"$f":"IF('BİLGİ GİRİŞİ'!T38=\"\",\"\",'BİLGİ GİRİŞİ'!T38)","v":""}]
[{"$f":"IF('BİLGİ GİRİŞİ'!D39=\"\",\"\",'BİLGİ GİRİŞİ'!D39)","v":""},{"$f":"IF('BİLGİ GİRİŞİ'!E39=\"\",\"\",'BİLGİ GİRİŞİ'!E39)","v":""},null,null,null,null,null,null,null,null,null,null,null,null,null,null,null,null,null,null,null,null,null,{"$f":"IF('BİLGİ GİRİŞİ'!W39=\"\",\"\",'BİLGİ GİRİŞİ'!W39)","v":""},null,null,null,{"$f":"IF('BİLGİ GİRİŞİ'!T39=\"\",\"\",'BİLGİ GİRİŞİ'!T39)","v":""}]
[{"$f":"IF('BİLGİ GİRİŞİ'!D40=\"\",\"\",'BİLGİ GİRİŞİ'!D40)","v":""},{"$f":"IF('BİLGİ GİRİŞİ'!E40=\"\",\"\",'BİLGİ GİRİŞİ'!E40)","v":""},null,null,null,null,null,null,null,null,null,null,null,null,null,null,null,null,null,null,null,null,null,{"$f":"IF('BİLGİ GİRİŞİ'!W40=\"\",\"\",'BİLGİ GİRİŞİ'!W40)","v":""},null,null,null,{"$f":"IF('BİLGİ GİRİŞİ'!T40=\"\",\"\",'BİLGİ GİRİŞİ'!T40)","v":""}]
[{"$f":"IF('BİLGİ GİRİŞİ'!D41=\"\",\"\",'BİLGİ GİRİŞİ'!D41)","v":""},{"$f":"IF('BİLGİ GİRİŞİ'!E41=\"\",\"\",'BİLGİ GİRİŞİ'!E41)","v":""},null,null,null,null,null,null,null,null,null,null,null,null,null,null,null,null,null,null,null,null,null,{"$f":"IF('BİLGİ GİRİŞİ'!W41=\"\",\"\",'BİLGİ GİRİŞİ'!W41)","v":""},null,null,null,{"$f":"IF('BİLGİ GİRİŞİ'!T41=\"\",\"\",'BİLGİ GİRİŞİ'!T41)","v":""}]
[{"$f":"IF('BİLGİ GİRİŞİ'!D42=\"\",\"\",'BİLGİ GİRİŞİ'!D42)","v":""},{"$f":"IF('BİLGİ GİRİŞİ'!E42=\"\",\"\",'BİLGİ GİRİŞİ'!E42)","v":""},null,null,null,null,null,null,null,null,null,null,null,null,null,null,null,null,null,null,null,null,null,{"$f":"IF('BİLGİ GİRİŞİ'!W42=\"\",\"\",'BİLGİ GİRİŞİ'!W42)","v":""},null,null,null,{"$f":"IF('BİLGİ GİRİŞİ'!T42=\"\",\"\",'BİLGİ GİRİŞİ'!T42)","v":""}]
[{"$f":"IF('BİLGİ GİRİŞİ'!D43=\"\",\"\",'BİLGİ GİRİŞİ'!D43)","v":""},{"$f":"IF('BİLGİ GİRİŞİ'!E43=\"\",\"\",'BİLGİ GİRİŞİ'!E43)","v":""},null,null,null,null,null,null,null,null,null,null,null,null,null,null,null,null,null,null,null,null,null,{"$f":"IF('BİLGİ GİRİŞİ'!W43=\"\",\"\",'BİLGİ GİRİŞİ'!W43)","v":""},null,null,null,{"$f":"IF('BİLGİ GİRİŞİ'!T43=\"\",\"\",'BİLGİ GİRİŞİ'!T43)","v":""}]
[{"$f":"IF('BİLGİ GİRİŞİ'!D44=\"\",\"\",'BİLGİ GİRİŞİ'!D44)","v":""},{"$f":"IF('BİLGİ GİRİŞİ'!E44=\"\",\"\",'BİLGİ GİRİŞİ'!E44)","v":""},null,null,null,null,null,null,null,null,null,null,null,null,null,null,null,null,null,null,null,null,null,{"$f":"IF('BİLGİ GİRİŞİ'!W44=\"\",\"\",'BİLGİ GİRİŞİ'!W44)","v":""},null,null,null,{"$f":"IF('BİLGİ GİRİŞİ'!T44=\"\",\"\",'BİLGİ GİRİŞİ'!T44)","v":""}]
[{"$f":"IF('BİLGİ GİRİŞİ'!D45=\"\",\"\",'BİLGİ GİRİŞİ'!D45)","v":""},{"$f":"IF('BİLGİ GİRİŞİ'!E45=\"\",\"\",'BİLGİ GİRİŞİ'!E45)","v":""},null,null,null,null,null,null,null,null,null,null,null,null,null,null,null,null,null,null,null,null,null,{"$f":"IF('BİLGİ GİRİŞİ'!W45=\"\",\"\",'BİLGİ GİRİŞİ'!W45)","v":""},null,null,null,{"$f":"IF('BİLGİ GİRİŞİ'!T45=\"\",\"\",'BİLGİ GİRİŞİ'!T45)","v":""}]
[{"$f":"IF('BİLGİ GİRİŞİ'!D46=\"\",\"\",'BİLGİ GİRİŞİ'!D46)","v":""},{"$f":"IF('BİLGİ GİRİŞİ'!E46=\"\",\"\",'BİLGİ GİRİŞİ'!E46)","v":""},null,null,null,null,null,null,null,null,null,null,null,null,null,null,null,null,null,null,null,null,null,{"$f":"IF('BİLGİ GİRİŞİ'!W46=\"\",\"\",'BİLGİ GİRİŞİ'!W46)","v":""},null,null,null,{"$f":"IF('BİLGİ GİRİŞİ'!T46=\"\",\"\",'BİLGİ GİRİŞİ'!T46)","v":""}]
[{"$f":"IF('BİLGİ GİRİŞİ'!D47=\"\",\"\",'BİLGİ GİRİŞİ'!D47)","v":""},{"$f":"IF('BİLGİ GİRİŞİ'!E47=\"\",\"\",'BİLGİ GİRİŞİ'!E47)","v":""},null,null,null,null,null,null,null,null,null,null,null,null,null,null,null,null,null,null,null,null,null,{"$f":"IF('BİLGİ GİRİŞİ'!W47=\"\",\"\",'BİLGİ GİRİŞİ'!W47)","v":""},null,null,null,{"$f":"IF('BİLGİ GİRİŞİ'!T47=\"\",\"\",'BİLGİ GİRİŞİ'!T47)","v":""}]
[{"$f":"IF('BİLGİ GİRİŞİ'!D48=\"\",\"\",'BİLGİ GİRİŞİ'!D48)","v":""},{"$f":"IF('BİLGİ GİRİŞİ'!E48=\"\",\"\",'BİLGİ GİRİŞİ'!E48)","v":""},null,null,null,null,null,null,null,null,null,null,null,null,null,null,null,null,null,null,null,null,null,{"$f":"IF('BİLGİ GİRİŞİ'!W48=\"\",\"\",'BİLGİ GİRİŞİ'!W48)","v":""},null,null,null,{"$f":"IF('BİLGİ GİRİŞİ'!T48=\"\",\"\",'BİLGİ GİRİŞİ'!T48)","v":""}]
[{"$f":"IF('BİLGİ GİRİŞİ'!D49=\"\",\"\",'BİLGİ GİRİŞİ'!D49)","v":""},{"$f":"IF('BİLGİ GİRİŞİ'!E49=\"\",\"\",'BİLGİ GİRİŞİ'!E49)","v":""},null,null,null,null,null,null,null,null,null,null,null,null,null,null,null,null,null,null,null,null,null,{"$f":"IF('BİLGİ GİRİŞİ'!W49=\"\",\"\",'BİLGİ GİRİŞİ'!W49)","v":""},null,null,null,{"$f":"IF('BİLGİ GİRİŞİ'!T49=\"\",\"\",'BİLGİ GİRİŞİ'!T49)","v":""}]
[{"$f":"IF('BİLGİ GİRİŞİ'!D50=\"\",\"\",'BİLGİ GİRİŞİ'!D50)","v":""},{"$f":"IF('BİLGİ GİRİŞİ'!E50=\"\",\"\",'BİLGİ GİRİŞİ'!E50)","v":""},null,null,null,null,null,null,null,null,null,null,null,null,null,null,null,null,null,null,null,null,null,{"$f":"IF('BİLGİ GİRİŞİ'!W50=\"\",\"\",'BİLGİ GİRİŞİ'!W50)","v":""},null,null,null,{"$f":"IF('BİLGİ GİRİŞİ'!T50=\"\",\"\",'BİLGİ GİRİŞİ'!T50)","v":""}]
[{"$f":"IF('BİLGİ GİRİŞİ'!D51=\"\",\"\",'BİLGİ GİRİŞİ'!D51)","v":""},{"$f":"IF('BİLGİ GİRİŞİ'!E51=\"\",\"\",'BİLGİ GİRİŞİ'!E51)","v":""},null,null,null,null,null,null,null,null,null,null,null,null,null,null,null,null,null,null,null,null,null,{"$f":"IF('BİLGİ GİRİŞİ'!W51=\"\",\"\",'BİLGİ GİRİŞİ'!W51)","v":""},null,null,null,{"$f":"IF('BİLGİ GİRİŞİ'!T51=\"\",\"\",'BİLGİ GİRİŞİ'!T51)","v":""}]
[{"$f":"IF('BİLGİ GİRİŞİ'!D52=\"\",\"\",'BİLGİ GİRİŞİ'!D52)","v":""},{"$f":"IF('BİLGİ GİRİŞİ'!E52=\"\",\"\",'BİLGİ GİRİŞİ'!E52)","v":""},null,null,null,null,null,null,null,null,null,null,null,null,null,null,null,null,null,null,null,null,null,{"$f":"IF('BİLGİ GİRİŞİ'!W52=\"\",\"\",'BİLGİ GİRİŞİ'!W52)","v":""},null,null,null,{"$f":"IF('BİLGİ GİRİŞİ'!T52=\"\",\"\",'BİLGİ GİRİŞİ'!T52)","v":""}]
[{"$f":"IF('BİLGİ GİRİŞİ'!D53=\"\",\"\",'BİLGİ GİRİŞİ'!D53)","v":""},{"$f":"IF('BİLGİ GİRİŞİ'!E53=\"\",\"\",'BİLGİ GİRİŞİ'!E53)","v":""},null,null,null,null,null,null,null,null,null,null,null,null,null,null,null,null,null,null,null,null,null,{"$f":"IF('BİLGİ GİRİŞİ'!W53=\"\",\"\",'BİLGİ GİRİŞİ'!W53)","v":""},null,null,null,{"$f":"IF('BİLGİ GİRİŞİ'!T53=\"\",\"\",'BİLGİ GİRİŞİ'!T53)","v":""}]
[{"$f":"IF('BİLGİ GİRİŞİ'!D54=\"\",\"\",'BİLGİ GİRİŞİ'!D54)","v":""},{"$f":"IF('BİLGİ GİRİŞİ'!E54=\"\",\"\",'BİLGİ GİRİŞİ'!E54)","v":""},null,null,null,null,null,null,null,null,null,null,null,null,null,null,null,null,null,null,null,null,null,{"$f":"IF('BİLGİ GİRİŞİ'!W54=\"\",\"\",'BİLGİ GİRİŞİ'!W54)","v":""},null,null,null,{"$f":"IF('BİLGİ GİRİŞİ'!T54=\"\",\"\",'BİLGİ GİRİŞİ'!T54)","v":""}]
[{"$f":"IF('BİLGİ GİRİŞİ'!D55=\"\",\"\",'BİLGİ GİRİŞİ'!D55)","v":""},{"$f":"IF('BİLGİ GİRİŞİ'!E55=\"\",\"\",'BİLGİ GİRİŞİ'!E55)","v":""},null,null,null,null,null,null,null,null,null,null,null,null,null,null,null,null,null,null,null,null,null,{"$f":"IF('BİLGİ GİRİŞİ'!W55=\"\",\"\",'BİLGİ GİRİŞİ'!W55)","v":""},null,null,null,{"$f":"IF('BİLGİ GİRİŞİ'!T55=\"\",\"\",'BİLGİ GİRİŞİ'!T55)","v":""}]
[{"$f":"IF('BİLGİ GİRİŞİ'!D56=\"\",\"\",'BİLGİ GİRİŞİ'!D56)","v":""},{"$f":"IF('BİLGİ GİRİŞİ'!E56=\"\",\"\",'BİLGİ GİRİŞİ'!E56)","v":""},null,null,null,null,null,null,null,null,null,null,null,null,null,null,null,null,null,null,null,null,null,{"$f":"IF('BİLGİ GİRİŞİ'!W56=\"\",\"\",'BİLGİ GİRİŞİ'!W56)","v":""},null,null,null,{"$f":"IF('BİLGİ GİRİŞİ'!T56=\"\",\"\",'BİLGİ GİRİŞİ'!T56)","v":""}]
[{"$f":"IF('BİLGİ GİRİŞİ'!D57=\"\",\"\",'BİLGİ GİRİŞİ'!D57)","v":""},{"$f":"IF('BİLGİ GİRİŞİ'!E57=\"\",\"\",'BİLGİ GİRİŞİ'!E57)","v":""},null,null,null,null,null,null,null,null,null,null,null,null,null,null,null,null,null,null,null,null,null,{"$f":"IF('BİLGİ GİRİŞİ'!W57=\"\",\"\",'BİLGİ GİRİŞİ'!W57)","v":""},null,null,null,{"$f":"IF('BİLGİ GİRİŞİ'!T57=\"\",\"\",'BİLGİ GİRİŞİ'!T57)","v":""}]
[{"$f":"IF('BİLGİ GİRİŞİ'!D58=\"\",\"\",'BİLGİ GİRİŞİ'!D58)","v":""},{"$f":"IF('BİLGİ GİRİŞİ'!E58=\"\",\"\",'BİLGİ GİRİŞİ'!E58)","v":""},null,null,null,null,null,null,null,null,null,null,null,null,null,null,null,null,null,null,null,null,null,{"$f":"IF('BİLGİ GİRİŞİ'!W58=\"\",\"\",'BİLGİ GİRİŞİ'!W58)","v":""},null,null,null,{"$f":"IF('BİLGİ GİRİŞİ'!T58=\"\",\"\",'BİLGİ GİRİŞİ'!T58)","v":""}]
[{"$f":"IF('BİLGİ GİRİŞİ'!D59=\"\",\"\",'BİLGİ GİRİŞİ'!D59)","v":""},{"$f":"IF('BİLGİ GİRİŞİ'!E59=\"\",\"\",'BİLGİ GİRİŞİ'!E59)","v":""},null,null,null,null,null,null,null,null,null,null,null,null,null,null,null,null,null,null,null,null,null,{"$f":"IF('BİLGİ GİRİŞİ'!W59=\"\",\"\",'BİLGİ GİRİŞİ'!W59)","v":""},null,null,null,{"$f":"IF('BİLGİ GİRİŞİ'!T59=\"\",\"\",'BİLGİ GİRİŞİ'!T59)","v":""}]
[{"$f":"IF('BİLGİ GİRİŞİ'!D60=\"\",\"\",'BİLGİ GİRİŞİ'!D60)","v":""},{"$f":"IF('BİLGİ GİRİŞİ'!E60=\"\",\"\",'BİLGİ GİRİŞİ'!E60)","v":""},null,null,null,null,null,null,null,null,null,null,null,null,null,null,null,null,null,null,null,null,null,{"$f":"IF('BİLGİ GİRİŞİ'!W60=\"\",\"\",'BİLGİ GİRİŞİ'!W60)","v":""},null,null,null,{"$f":"IF('BİLGİ GİRİŞİ'!T60=\"\",\"\",'BİLGİ GİRİŞİ'!T60)","v":""}]
[{"$f":"IF('BİLGİ GİRİŞİ'!D61=\"\",\"\",'BİLGİ GİRİŞİ'!D61)","v":""},{"$f":"IF('BİLGİ GİRİŞİ'!E61=\"\",\"\",'BİLGİ GİRİŞİ'!E61)","v":""},null,null,null,null,null,null,null,null,null,null,null,null,null,null,null,null,null,null,null,null,null,{"$f":"IF('BİLGİ GİRİŞİ'!W61=\"\",\"\",'BİLGİ GİRİŞİ'!W61)","v":""},null,null,null,{"$f":"IF('BİLGİ GİRİŞİ'!T61=\"\",\"\",'BİLGİ GİRİŞİ'!T61)","v":""}]
[{"$f":"IF('BİLGİ GİRİŞİ'!D62=\"\",\"\",'BİLGİ GİRİŞİ'!D62)","v":""},{"$f":"IF('BİLGİ GİRİŞİ'!E62=\"\",\"\",'BİLGİ GİRİŞİ'!E62)","v":""},null,null,null,null,null,null,null,null,null,null,null,null,null,null,null,null,null,null,null,null,null,{"$f":"IF('BİLGİ GİRİŞİ'!W62=\"\",\"\",'BİLGİ GİRİŞİ'!W62)","v":""},null,null,null,{"$f":"IF('BİLGİ GİRİŞİ'!T62=\"\",\"\",'BİLGİ GİRİŞİ'!T62)","v":""}]
[{"$f":"IF('BİLGİ GİRİŞİ'!D63=\"\",\"\",'BİLGİ GİRİŞİ'!D63)","v":""},{"$f":"IF('BİLGİ GİRİŞİ'!E63=\"\",\"\",'BİLGİ GİRİŞİ'!E63)","v":""},null,null,null,null,null,null,null,null,null,null,null,null,null,null,null,null,null,null,null,null,null,{"$f":"IF('BİLGİ GİRİŞİ'!W63=\"\",\"\",'BİLGİ GİRİŞİ'!W63)","v":""},null,null,null,{"$f":"IF('BİLGİ GİRİŞİ'!T63=\"\",\"\",'BİLGİ GİRİŞİ'!T63)","v":""}]
[{"$f":"IF('BİLGİ GİRİŞİ'!D64=\"\",\"\",'BİLGİ GİRİŞİ'!D64)","v":""},{"$f":"IF('BİLGİ GİRİŞİ'!E64=\"\",\"\",'BİLGİ GİRİŞİ'!E64)","v":""},null,null,null,null,null,null,null,null,null,null,null,null,null,null,null,null,null,null,null,null,null,{"$f":"IF('BİLGİ GİRİŞİ'!W64=\"\",\"\",'BİLGİ GİRİŞİ'!W64)","v":""},null,null,null,{"$f":"IF('BİLGİ GİRİŞİ'!T64=\"\",\"\",'BİLGİ GİRİŞİ'!T64)","v":""}]
[{"$f":"IF('BİLGİ GİRİŞİ'!D65=\"\",\"\",'BİLGİ GİRİŞİ'!D65)","v":""},{"$f":"IF('BİLGİ GİRİŞİ'!E65=\"\",\"\",'BİLGİ GİRİŞİ'!E65)","v":""},null,null,null,null,null,null,null,null,null,null,null,null,null,null,null,null,null,null,null,null,null,{"$f":"IF('BİLGİ GİRİŞİ'!W65=\"\",\"\",'BİLGİ GİRİŞİ'!W65)","v":""},null,null,null,{"$f":"IF('BİLGİ GİRİŞİ'!T65=\"\",\"\",'BİLGİ GİRİŞİ'!T65)","v":""}]
[{"$f":"IF('BİLGİ GİRİŞİ'!D66=\"\",\"\",'BİLGİ GİRİŞİ'!D66)","v":""},{"$f":"IF('BİLGİ GİRİŞİ'!E66=\"\",\"\",'BİLGİ GİRİŞİ'!E66)","v":""},null,null,null,null,null,null,null,null,null,null,null,null,null,null,null,null,null,null,null,null,null,{"$f":"IF('BİLGİ GİRİŞİ'!W66=\"\",\"\",'BİLGİ GİRİŞİ'!W66)","v":""},null,null,null,{"$f":"IF('BİLGİ GİRİŞİ'!T66=\"\",\"\",'BİLGİ GİRİŞİ'!T66)","v":""}]
[{"$f":"IF('BİLGİ GİRİŞİ'!D67=\"\",\"\",'BİLGİ GİRİŞİ'!D67)","v":""},{"$f":"IF('BİLGİ GİRİŞİ'!E67=\"\",\"\",'BİLGİ GİRİŞİ'!E67)","v":""},null,null,null,null,null,null,null,null,null,null,null,null,null,null,null,null,null,null,null,null,null,{"$f":"IF('BİLGİ GİRİŞİ'!W67=\"\",\"\",'BİLGİ GİRİŞİ'!W67)","v":""},null,null,null,{"$f":"IF('BİLGİ GİRİŞİ'!T67=\"\",\"\",'BİLGİ GİRİŞİ'!T67)","v":""}]
[{"$f":"IF('BİLGİ GİRİŞİ'!D68=\"\",\"\",'BİLGİ GİRİŞİ'!D68)","v":""},{"$f":"IF('BİLGİ GİRİŞİ'!E68=\"\",\"\",'BİLGİ GİRİŞİ'!E68)","v":""},null,null,null,null,null,null,null,null,null,null,null,null,null,null,null,null,null,null,null,null,null,{"$f":"IF('BİLGİ GİRİŞİ'!W68=\"\",\"\",'BİLGİ GİRİŞİ'!W68)","v":""},null,null,null,{"$f":"IF('BİLGİ GİRİŞİ'!T68=\"\",\"\",'BİLGİ GİRİŞİ'!T68)","v":""}]
[{"$f":"IF('BİLGİ GİRİŞİ'!D69=\"\",\"\",'BİLGİ GİRİŞİ'!D69)","v":""},{"$f":"IF('BİLGİ GİRİŞİ'!E69=\"\",\"\",'BİLGİ GİRİŞİ'!E69)","v":""},null,null,null,null,null,null,null,null,null,null,null,null,null,null,null,null,null,null,null,null,null,{"$f":"IF('BİLGİ GİRİŞİ'!W69=\"\",\"\",'BİLGİ GİRİŞİ'!W69)","v":""},null,null,null,{"$f":"IF('BİLGİ GİRİŞİ'!T69=\"\",\"\",'BİLGİ GİRİŞİ'!T69)","v":""}]
[{"$f":"IF('BİLGİ GİRİŞİ'!D70=\"\",\"\",'BİLGİ GİRİŞİ'!D70)","v":""},{"$f":"IF('BİLGİ GİRİŞİ'!E70=\"\",\"\",'BİLGİ GİRİŞİ'!E70)","v":""},null,null,null,null,null,null,null,null,null,null,null,null,null,null,null,null,null,null,null,null,null,{"$f":"IF('BİLGİ GİRİŞİ'!W70=\"\",\"\",'BİLGİ GİRİŞİ'!W70)","v":""},null,null,null,{"$f":"IF('BİLGİ GİRİŞİ'!T70=\"\",\"\",'BİLGİ GİRİŞİ'!T70)","v":""}]
[{"$f":"IF('BİLGİ GİRİŞİ'!D71=\"\",\"\",'BİLGİ GİRİŞİ'!D71)","v":""},{"$f":"IF('BİLGİ GİRİŞİ'!E71=\"\",\"\",'BİLGİ GİRİŞİ'!E71)","v":""},null,null,null,null,null,null,null,null,null,null,null,null,null,null,null,null,null,null,null,null,null,{"$f":"IF('BİLGİ GİRİŞİ'!W71=\"\",\"\",'BİLGİ GİRİŞİ'!W71)","v":""},null,null,null,{"$f":"IF('BİLGİ GİRİŞİ'!T71=\"\",\"\",'BİLGİ GİRİŞİ'!T71)","v":""}]
[{"$f":"IF('BİLGİ GİRİŞİ'!D72=\"\",\"\",'BİLGİ GİRİŞİ'!D72)","v":""},{"$f":"IF('BİLGİ GİRİŞİ'!E72=\"\",\"\",'BİLGİ GİRİŞİ'!E72)","v":""},null,null,null,null,null,null,null,null,null,null,null,null,null,null,null,null,null,null,null,null,null,{"$f":"IF('BİLGİ GİRİŞİ'!W72=\"\",\"\",'BİLGİ GİRİŞİ'!W72)","v":""},null,null,null,{"$f":"IF('BİLGİ GİRİŞİ'!T72=\"\",\"\",'BİLGİ GİRİŞİ'!T72)","v":""}]
[{"$f":"IF('BİLGİ GİRİŞİ'!D73=\"\",\"\",'BİLGİ GİRİŞİ'!D73)","v":""},{"$f":"IF('BİLGİ GİRİŞİ'!E73=\"\",\"\",'BİLGİ GİRİŞİ'!E73)","v":""},null,null,null,null,null,null,null,null,null,null,null,null,null,null,null,null,null,null,null,null,null,{"$f":"IF('BİLGİ GİRİŞİ'!W73=\"\",\"\",'BİLGİ GİRİŞİ'!W73)","v":""},null,null,null,{"$f":"IF('BİLGİ GİRİŞİ'!T73=\"\",\"\",'BİLGİ GİRİŞİ'!T73)","v":""}]
[{"$f":"IF('BİLGİ GİRİŞİ'!D74=\"\",\"\",'BİLGİ GİRİŞİ'!D74)","v":""},{"$f":"IF('BİLGİ GİRİŞİ'!E74=\"\",\"\",'BİLGİ GİRİŞİ'!E74)","v":""},null,null,null,null,null,null,null,null,null,null,null,null,null,null,null,null,null,null,null,null,null,{"$f":"IF('BİLGİ GİRİŞİ'!W74=\"\",\"\",'BİLGİ GİRİŞİ'!W74)","v":""},null,null,null,{"$f":"IF('BİLGİ GİRİŞİ'!T74=\"\",\"\",'BİLGİ GİRİŞİ'!T74)","v":""}]
[{"$f":"IF('BİLGİ GİRİŞİ'!D75=\"\",\"\",'BİLGİ GİRİŞİ'!D75)","v":""},{"$f":"IF('BİLGİ GİRİŞİ'!E75=\"\",\"\",'BİLGİ GİRİŞİ'!E75)","v":""},null,null,null,null,null,null,null,null,null,null,null,null,null,null,null,null,null,null,null,null,null,{"$f":"IF('BİLGİ GİRİŞİ'!W75=\"\",\"\",'BİLGİ GİRİŞİ'!W75)","v":""},null,null,null,{"$f":"IF('BİLGİ GİRİŞİ'!T75=\"\",\"\",'BİLGİ GİRİŞİ'!T75)","v":""}]
[{"$f":"IF('BİLGİ GİRİŞİ'!D76=\"\",\"\",'BİLGİ GİRİŞİ'!D76)","v":""},{"$f":"IF('BİLGİ GİRİŞİ'!E76=\"\",\"\",'BİLGİ GİRİŞİ'!E76)","v":""},null,null,null,null,null,null,null,null,null,null,null,null,null,null,null,null,null,null,null,null,null,{"$f":"IF('BİLGİ GİRİŞİ'!W76=\"\",\"\",'BİLGİ GİRİŞİ'!W76)","v":""},null,null,null,{"$f":"IF('BİLGİ GİRİŞİ'!T76=\"\",\"\",'BİLGİ GİRİŞİ'!T76)","v":""}]
[{"$f":"IF('BİLGİ GİRİŞİ'!D77=\"\",\"\",'BİLGİ GİRİŞİ'!D77)","v":""},{"$f":"IF('BİLGİ GİRİŞİ'!E77=\"\",\"\",'BİLGİ GİRİŞİ'!E77)","v":""},null,null,null,null,null,null,null,null,null,null,null,null,null,null,null,null,null,null,null,null,null,{"$f":"IF('BİLGİ GİRİŞİ'!W77=\"\",\"\",'BİLGİ GİRİŞİ'!W77)","v":""},null,null,null,{"$f":"IF('BİLGİ GİRİŞİ'!T77=\"\",\"\",'BİLGİ GİRİŞİ'!T77)","v":""}]
[{"$f":"IF('BİLGİ GİRİŞİ'!D78=\"\",\"\",'BİLGİ GİRİŞİ'!D78)","v":""},{"$f":"IF('BİLGİ GİRİŞİ'!E78=\"\",\"\",'BİLGİ GİRİŞİ'!E78)","v":""},null,null,null,null,null,null,null,null,null,null,null,null,null,null,null,null,null,null,null,null,null,{"$f":"IF('BİLGİ GİRİŞİ'!W78=\"\",\"\",'BİLGİ GİRİŞİ'!W78)","v":""},null,null,null,{"$f":"IF('BİLGİ GİRİŞİ'!T78=\"\",\"\",'BİLGİ GİRİŞİ'!T78)","v":""}]
[{"$f":"IF('BİLGİ GİRİŞİ'!D79=\"\",\"\",'BİLGİ GİRİŞİ'!D79)","v":""},{"$f":"IF('BİLGİ GİRİŞİ'!E79=\"\",\"\",'BİLGİ GİRİŞİ'!E79)","v":""},null,null,null,null,null,null,null,null,null,null,null,null,null,null,null,null,null,null,null,null,null,{"$f":"IF('BİLGİ GİRİŞİ'!W79=\"\",\"\",'BİLGİ GİRİŞİ'!W79)","v":""},null,null,null,{"$f":"IF('BİLGİ GİRİŞİ'!T79=\"\",\"\",'BİLGİ GİRİŞİ'!T79)","v":""}]
[{"$f":"IF('BİLGİ GİRİŞİ'!D80=\"\",\"\",'BİLGİ GİRİŞİ'!D80)","v":""},{"$f":"IF('BİLGİ GİRİŞİ'!E80=\"\",\"\",'BİLGİ GİRİŞİ'!E80)","v":""},null,null,null,null,null,null,null,null,null,null,null,null,null,null,null,null,null,null,null,null,null,{"$f":"IF('BİLGİ GİRİŞİ'!W80=\"\",\"\",'BİLGİ GİRİŞİ'!W80)","v":""},null,null,null,{"$f":"IF('BİLGİ GİRİŞİ'!T80=\"\",\"\",'BİLGİ GİRİŞİ'!T80)","v":""}]
[{"$f":"IF('BİLGİ GİRİŞİ'!D81=\"\",\"\",'BİLGİ GİRİŞİ'!D81)","v":""},{"$f":"IF('BİLGİ GİRİŞİ'!E81=\"\",\"\",'BİLGİ GİRİŞİ'!E81)","v":""},null,null,null,null,null,null,null,null,null,null,null,null,null,null,null,null,null,null,null,null,null,{"$f":"IF('BİLGİ GİRİŞİ'!W81=\"\",\"\",'BİLGİ GİRİŞİ'!W81)","v":""},null,null,null,{"$f":"IF('BİLGİ GİRİŞİ'!T81=\"\",\"\",'BİLGİ GİRİŞİ'!T81)","v":""}]
[{"$f":"IF('BİLGİ GİRİŞİ'!D82=\"\",\"\",'BİLGİ GİRİŞİ'!D82)","v":""},{"$f":"IF('BİLGİ GİRİŞİ'!E82=\"\",\"\",'BİLGİ GİRİŞİ'!E82)","v":""},null,null,null,null,null,null,null,null,null,null,null,null,null,null,null,null,null,null,null,null,null,{"$f":"IF('BİLGİ GİRİŞİ'!W82=\"\",\"\",'BİLGİ GİRİŞİ'!W82)","v":""},null,null,null,{"$f":"IF('BİLGİ GİRİŞİ'!T82=\"\",\"\",'BİLGİ GİRİŞİ'!T82)","v":""}]
[{"$f":"IF('BİLGİ GİRİŞİ'!D83=\"\",\"\",'BİLGİ GİRİŞİ'!D83)","v":""},{"$f":"IF('BİLGİ GİRİŞİ'!E83=\"\",\"\",'BİLGİ GİRİŞİ'!E83)","v":""},null,null,null,null,null,null,null,null,null,null,null,null,null,null,null,null,null,null,null,null,null,{"$f":"IF('BİLGİ GİRİŞİ'!W83=\"\",\"\",'BİLGİ GİRİŞİ'!W83)","v":""},null,null,null,{"$f":"IF('BİLGİ GİRİŞİ'!T83=\"\",\"\",'BİLGİ GİRİŞİ'!T83)","v":""}]
[{"$f":"IF('BİLGİ GİRİŞİ'!D84=\"\",\"\",'BİLGİ GİRİŞİ'!D84)","v":""},{"$f":"IF('BİLGİ GİRİŞİ'!E84=\"\",\"\",'BİLGİ GİRİŞİ'!E84)","v":""},null,null,null,null,null,null,null,null,null,null,null,null,null,null,null,null,null,null,null,null,null,{"$f":"IF('BİLGİ GİRİŞİ'!W84=\"\",\"\",'BİLGİ GİRİŞİ'!W84)","v":""},null,null,null,{"$f":"IF('BİLGİ GİRİŞİ'!T84=\"\",\"\",'BİLGİ GİRİŞİ'!T84)","v":""}]
[{"$f":"IF('BİLGİ GİRİŞİ'!D85=\"\",\"\",'BİLGİ GİRİŞİ'!D85)","v":""},{"$f":"IF('BİLGİ GİRİŞİ'!E85=\"\",\"\",'BİLGİ GİRİŞİ'!E85)","v":""},null,null,null,null,null,null,null,null,null,null,null,null,null,null,null,null,null,null,null,null,null,{"$f":"IF('BİLGİ GİRİŞİ'!W85=\"\",\"\",'BİLGİ GİRİŞİ'!W85)","v":""},null,null,null,{"$f":"IF('BİLGİ GİRİŞİ'!T85=\"\",\"\",'BİLGİ GİRİŞİ'!T85)","v":""}]
[{"$f":"IF('BİLGİ GİRİŞİ'!D86=\"\",\"\",'BİLGİ GİRİŞİ'!D86)","v":""},{"$f":"IF('BİLGİ GİRİŞİ'!E86=\"\",\"\",'BİLGİ GİRİŞİ'!E86)","v":""},null,null,null,null,null,null,null,null,null,null,null,null,null,null,null,null,null,null,null,null,null,{"$f":"IF('BİLGİ GİRİŞİ'!W86=\"\",\"\",'BİLGİ GİRİŞİ'!W86)","v":""},null,null,null,{"$f":"IF('BİLGİ GİRİŞİ'!T86=\"\",\"\",'BİLGİ GİRİŞİ'!T86)","v":""}]
[{"$f":"IF('BİLGİ GİRİŞİ'!D87=\"\",\"\",'BİLGİ GİRİŞİ'!D87)","v":""},{"$f":"IF('BİLGİ GİRİŞİ'!E87=\"\",\"\",'BİLGİ GİRİŞİ'!E87)","v":""},null,null,null,null,null,null,null,null,null,null,null,null,null,null,null,null,null,null,null,null,null,{"$f":"IF('BİLGİ GİRİŞİ'!W87=\"\",\"\",'BİLGİ GİRİŞİ'!W87)","v":""},null,null,null,{"$f":"IF('BİLGİ GİRİŞİ'!T87=\"\",\"\",'BİLGİ GİRİŞİ'!T87)","v":""}]
[{"$f":"IF('BİLGİ GİRİŞİ'!D88=\"\",\"\",'BİLGİ GİRİŞİ'!D88)","v":""},{"$f":"IF('BİLGİ GİRİŞİ'!E88=\"\",\"\",'BİLGİ GİRİŞİ'!E88)","v":""},null,null,null,null,null,null,null,null,null,null,null,null,null,null,null,null,null,null,null,null,null,{"$f":"IF('BİLGİ GİRİŞİ'!W88=\"\",\"\",'BİLGİ GİRİŞİ'!W88)","v":""},null,null,null,{"$f":"IF('BİLGİ GİRİŞİ'!T88=\"\",\"\",'BİLGİ GİRİŞİ'!T88)","v":""}]
[{"$f":"IF('BİLGİ GİRİŞİ'!D89=\"\",\"\",'BİLGİ GİRİŞİ'!D89)","v":""},{"$f":"IF('BİLGİ GİRİŞİ'!E89=\"\",\"\",'BİLGİ GİRİŞİ'!E89)","v":""},null,null,null,null,null,null,null,null,null,null,null,null,null,null,null,null,null,null,null,null,null,{"$f":"IF('BİLGİ GİRİŞİ'!W89=\"\",\"\",'BİLGİ GİRİŞİ'!W89)","v":""},null,null,null,{"$f":"IF('BİLGİ GİRİŞİ'!T89=\"\",\"\",'BİLGİ GİRİŞİ'!T89)","v":""}]
[]
["PİYASA ARAŞTIRMA GÖREVLİLERİ"]
[{"$f":"IF('BİLGİ GİRİŞİ'!AB17=\"\",\"\",'BİLGİ GİRİŞİ'!AB17)","v":"Ahmet DEMİR"},null,null,null,null,null,null,null,null,null,{"$f":"IF('BİLGİ GİRİŞİ'!AH17=\"\",\"\",'BİLGİ GİRİŞİ'!AH17)","v":"Ayşe YILDIZ"},null,null,null,null,null,null,null,null,null,null,{"$f":"IF('BİLGİ GİRİŞİ'!AN17=\"\",\"\",'BİLGİ GİRİŞİ'!AN17)","v":""}]
[{"$f":"IF(A94=\"\",\"\",'BİLGİ GİRİŞİ'!AB18)","v":"Müdür Yardımcısı 1"},null,null,null,null,null,null,null,null,null,{"$f":"IF(K94=\"\",\"\",'BİLGİ GİRİŞİ'!AH18)","v":"Öğretmen 1"},null,null,null,null,null,null,null,null,null,null,{"$f":"IF(V94=\"\",\"\",'BİLGİ GİRİŞİ'!AN18)","v":""}]
[]
["MUAYENE VE KABUL GÖREVLİLERİ"]
[{"$f":"IF('BİLGİ GİRİŞİ'!AB22=\"\",\"\",'BİLGİ GİRİŞİ'!AB22)","v":"Mehmet  ÇELİK"},null,null,null,null,null,null,null,null,null,{"$f":"IF('BİLGİ GİRİŞİ'!AH22=\"\",\"\",'BİLGİ GİRİŞİ'!AH22)","v":"Fatma GÜNEŞ"},null,null,null,null,null,null,null,null,null,null,{"$f":"IF('BİLGİ GİRİŞİ'!AN22=\"\",\"\",'BİLGİ GİRİŞİ'!AN22)","v":""}]
[{"$f":"IF(A98=\"\",\"\",'BİLGİ GİRİŞİ'!AB23)","v":"Müdür Yardımcısı 2"},null,null,null,null,null,null,null,null,null,{"$f":"IF(K98=\"\",\"\",'BİLGİ GİRİŞİ'!AH23)","v":"Öğretmen 2"},null,null,null,null,null,null,null,null,null,null,{"$f":"IF(V98=\"\",\"\",'BİLGİ GİRİŞİ'!AN23)","v":""}]

{"sheet":"2","index":3,"n_rows":94,"n_cols":28,"rows_kept":94,"cut":false,"hidden":false,"merged":[[88,1,88,14],[88,15,88,18],[88,19,88,22],[88,23,88,26],[88,27,88,30],[89,1,89,14],[89,15,89,18],[89,19,89,22],[89,23,89,26],[89,27,89,30],[86,1,86,14],[86,15,86,18],[86,19,86,22],[86,23,86,26],[86,27,86,30],[87,1,87,14],[87,15,87,18],[87,19,87,22],[87,23,87,26],[87,27,87,30],[84,1,84,14],[84,15,84,18],[84,19,84,22],[84,23,84,26],[84,27,84,30],[85,1,85,14],[85,15,85,18],[85,19,85,22],[85,23,85,26],[85,27,85,30],[82,1,82,14],[82,15,82,18],[82,19,82,22],[82,23,82,26],[82,27,82,30],[83,1,83,14],[83,15,83,18],[83,19,83,22],[83,23,83,26],[83,27,83,30],[80,1,80,14],[80,15,80,18],[80,19,80,22],[80,23,80,26],[80,27,80,30],[81,1,81,14],[81,15,81,18],[81,19,81,22],[81,23,81,26],[81,27,81,30],[78,1,78,14],[78,15,78,18],[78,19,78,22],[78,23,78,26],[78,27,78,30],[79,1,79,14],[79,15,79,18],[79,19,79,22],[79,23,79,26],[79,27,79,30],[76,1,76,14],[76,15,76,18],[76,19,76,22],[76,23,76,26],[76,27,76,30],[77,1,77,14],[77,15,77,18],[77,19,77,22],[77,23,77,26],[77,27,77,30],[74,1,74,14],[74,15,74,18],[74,19,74,22],[74,23,74,26],[74,27,74,30],[75,1,75,14],[75,15,75,18],[75,19,75,22],[75,23,75,26],[75,27,75,30],[72,1,72,14],[72,15,72,18],[72,19,72,22],[72,23,72,26],[72,27,72,30],[73,1,73,14],[73,15,73,18],[73,19,73,22],[73,23,73,26],[73,27,73,30],[70,1,70,14],[70,15,70,18],[70,19,70,22],[70,23,70,26],[70,27,70,30],[71,1,71,14],[71,15,71,18],[71,19,71,22],[71,23,71,26],[71,27,71,30],[91,0,91,22],[91,23,91,26],[91,27,91,30],[93,20,93,30],[10,0,11,30],[12,0,14,30],[49,1,49,14],[49,15,49,18],[49,19,49,22],[49,23,49,26],[49,27,49,30],[90,1,90,14],[90,15,90,18],[90,19,90,22],[90,23,90,26],[90,27,90,30],[47,1,47,14],[47,15,47,18],[47,19,47,22],[47,23,47,26],[47,27,47,30],[48,1,48,14],[48,15,48,18],[48,19,48,22],[48,23,48,26],[48,27,48,30],[45,1,45,14],[45,15,45,18],[45,19,45,22],[45,23,45,26],[45,27,45,30],[46,1,46,14],[46,15,46,18],[46,19,46,22],[46,23,46,26],[46,27,46,30],[43,1,43,14],[43,15,43,18],[43,19,43,22],[43,23,43,26],[43,27,43,30],[44,1,44,14],[44,15,44,18],[44,19,44,22],[44,23,44,26],[44,27,44,30],[41,1,41,14],[41,15,41,18],[41,19,41,22],[41,23,41,26],[41,27,41,30],[42,1,42,14],[42,15,42,18],[42,19,42,22],[42,23,42,26],[42,27,42,30],[39,1,39,14],[39,15,39,18],[39,19,39,22],[39,23,39,26],[39,27,39,30],[40,1,40,14],[40,15,40,18],[40,19,40,22],[40,23,40,26],[40,27,40,30],[37,1,37,14],[37,15,37,18],[37,19,37,22],[37,23,37,26],[37,27,37,30],[38,1,38,14],[38,15,38,18],[38,19,38,22],[38,23,38,26],[38,27,38,30],[35,1,35,14],[35,15,35,18],[35,19,35,22],[35,23,35,26],[35,27,35,30],[36,1,36,14],[36,15,36,18],[36,19,36,22],[36,23,36,26],[36,27,36,30],[33,1,33,14],[33,19,33,22],[33,15,33,18],[33,23,33,26],[33,27,33,30],[34,1,34,14],[34,15,34,18],[34,19,34,22],[34,23,34,26],[34,27,34,30],[31,1,31,14],[31,19,31,22],[31,15,31,18],[31,23,31,26],[31,27,31,30],[32,1,32,14],[32,19,32,22],[32,15,32,18],[32,23,32,26],[32,27,32,30],[30,1,30,14],[30,15,30,18],[30,19,30,22],[30,23,30,26],[30,27,30,30],[6,0,6,2],[6,4,6,26],[8,0,8,30],[18,20,18,30],[19,20,19,30],[17,10,17,19],[17,20,17,30],[1,0,1,30],[2,0,2,30],[3,0,3,30],[5,0,5,2],[5,4,5,21],[5,25,5,30],[22,0,22,30],[24,0,26,30],[29,0,29,30],[18,10,18,19],[19,10,19,19],[18,0,18,9],[19,0,19,9],[17,0,17,9],[50,1,50,14],[51,1,51,14],[52,1,52,14],[53,1,53,14],[54,1,54,14],[55,1,55,14],[56,1,56,14],[57,1,57,14],[58,1,58,14],[59,1,59,14],[60,1,60,14],[61,1,61,14],[62,1,62,14],[63,1,63,14],[64,1,64,14],[65,1,65,14],[66,1,66,14],[67,1,67,14],[68,1,68,14],[69,1,69,14],[50,15,50,18],[50,19,50,22],[50,23,50,26],[50,27,50,30],[51,15,51,18],[51,19,51,22],[51,23,51,26],[51,27,51,30],[52,15,52,18],[52,19,52,22],[52,23,52,26],[52,27,52,30],[53,15,53,18],[53,19,53,22],[53,23,53,26],[53,27,53,30],[54,15,54,18],[54,19,54,22],[54,23,54,26],[54,27,54,30],[55,15,55,18],[55,19,55,22],[55,23,55,26],[55,27,55,30],[56,15,56,18],[56,19,56,22],[56,23,56,26],[56,27,56,30],[57,15,57,18],[57,19,57,22],[57,23,57,26],[57,27,57,30],[58,15,58,18],[58,19,58,22],[58,23,58,26],[58,27,58,30],[59,15,59,18],[59,19,59,22],[59,23,59,26],[59,27,59,30],[60,15,60,18],[60,19,60,22],[60,23,60,26],[60,27,60,30],[61,15,61,18],[61,19,61,22],[61,23,61,26],[61,27,61,30],[62,15,62,18],[62,19,62,22],[62,23,62,26],[62,27,62,30],[63,15,63,18],[63,19,63,22],[63,23,63,26],[63,27,63,30],[64,15,64,18],[64,19,64,22],[64,23,64,26],[64,27,64,30],[65,15,65,18],[65,19,65,22],[65,23,65,26],[65,27,65,30],[66,15,66,18],[66,19,66,22],[66,23,66,26],[66,27,66,30],[67,15,67,18],[67,19,67,22],[67,23,67,26],[67,27,67,30],[68,15,68,18],[68,19,68,22],[68,23,68,26],[68,27,68,30],[69,15,69,18],[69,19,69,22],[69,23,69,26],[69,27,69,30]]}
[]
["T.C."]
[{"$f":"IF('BİLGİ GİRİŞİ'!O7=\"\",\"\",'BİLGİ GİRİŞİ'!O7)","v":"BULANIK KAYMAKAMLIĞI"}]
[{"$f":"IF('BİLGİ GİRİŞİ'!O8=\"\",\"\",'BİLGİ GİRİŞİ'!O8)","v":"Atatürk İlkokulu Müdürlüğü"}]
[]
["Sayı",null,null,":",{"$f":"IF('BİLGİ GİRİŞİ'!S15=\"\",\"\",'BİLGİ GİRİŞİ'!S15)","v":456789123},null,null,null,null,null,null,null,null,null,null,null,null,null,null,null,null,null,null,null,null,{"$f":"IF('BİLGİ GİRİŞİ'!O16=\"\",\"…../…../……..\",'BİLGİ GİRİŞİ'!O16)","v":"2023-03-06"}]
["Konu",null,null,":","Yaklaşık Maliyet Araştırması"]
[]
["İLGİLİ GERÇEK/TÜZEL KİŞİLERE"]
[]
[{"$f":"CONCATENATE(\"       \",\"Kurumumuz ihtiyaçlarında kullanılmak üzere aşağıda bilgileri verilen  Mal/Hizmet/Yapım İşi,  Kamu İhale Kanunu'nun \",IF('BİLGİ GİRİŞİ'!O10=\"\",\".............................................................................\",'BİLGİ GİRİŞİ'!O10),\" maddesine göre Doğrudan Temin yoluyla satın alınacaktır.\")","v":"       Kurumumuz ihtiyaçlarında kullanılmak üzere aşağıda bilgileri verilen  Mal/Hizmet/Yapım İşi,  Kamu İhale Kanunu'nun 22/d maddesine göre Doğrudan Temin yoluyla satın alınacaktır."}]
[]
["          Yaklaşık maliyetin tespitinde değerlendirilmek üzere aşağıda bilgileri verilen Mal'ın/Hizmet'in/Yapım İşi'nin, KDV hariç piyasa fiyatlarının karşılarına yazılması ve Kurumumuza gönderilmesi hususunda;\n        Gereğini rica ederim/ederiz"]
[]
[]
[]
[]
[{"$f":"IF(A19=\"\",\"\",IF('BİLGİ GİRİŞİ'!AH16=\"\",\"\",'BİLGİ GİRİŞİ'!AH16))","v":"Piyasa Araştırma Görevlisi"},null,null,null,null,null,null,null,null,null,{"$f":"IF(K19=\"\",\"\",IF('BİLGİ GİRİŞİ'!AN16=\"\",\"\",'BİLGİ GİRİŞİ'!AN16))","v":""},null,null,null,null,null,null,null,null,null,{"$f":"IF(U19=\"\",\"\",IF('BİLGİ GİRİŞİ'!AB16=\"\",\"\",'BİLGİ GİRİŞİ'!AB16))","v":"Piyasa Araştırma Görevlisi"}]
[{"$f":"IF('BİLGİ GİRİŞİ'!AH17=\"\",\"\",'BİLGİ GİRİŞİ'!AH17)","v":"Ayşe YILDIZ"},null,null,null,null,null,null,null,null,null,{"$f":"IF('BİLGİ GİRİŞİ'!AN17=\"\",\"\",'BİLGİ GİRİŞİ'!AN17)","v":""},null,null,null,null,null,null,null,null,null,{"$f":"IF('BİLGİ GİRİŞİ'!AB17=\"\",\"\",'BİLGİ GİRİŞİ'!AB17)","v":"Ahmet DEMİR"}]
[{"$f":"IF(A19=\"\",\"\",IF('BİLGİ GİRİŞİ'!AH18=\"\",\"\",'BİLGİ GİRİŞİ'!AH18))","v":"Öğretmen 1"},null,null,null,null,null,null,null,null,null,{"$f":"IF(K19=\"\",\"\",IF('BİLGİ GİRİŞİ'!AN18=\"\",\"\",'BİLGİ GİRİŞİ'!AN18))","v":""},null,null,null,null,null,null,null,null,null,{"$f":"IF(U19=\"\",\"\",IF('BİLGİ GİRİŞİ'!AB18=\"\",\"\",'BİLGİ GİRİŞİ'!AB18))","v":"Müdür Yardımcısı 1"}]
[]
[]
[{"$f":"IF('BİLGİ GİRİŞİ'!O8=\"\",\"\",CONCATENATE(UPPER('BİLGİ GİRİŞİ'!O8),\"\",UPPER(IF('BİLGİ GİRİŞİ'!O8=\"\",\"\",'BİLGİ GİRİŞİ'!AN8))))","v":"ATATÜRK İLKOKULU MÜDÜRLÜĞÜNE"}]
[]
["          Kurumunuzca satın alınacak Mal'ın/Hizmet'in/Yapım İşi'nin piyasa fiyatları aşağıya çıkarılmıştır.\n          Gereğini bilgilerinize arz ederim/ederiz."]
[]
[]
[]
[]
["MAL'IN/HİZMET'İN/YAPIM İŞİ'NİN"]
["S","Kalem/KısımBilgileri",null,null,null,null,null,null,null,null,null,null,null,null,null,"Birimi",null,null,null,"Miktarı",null,null,null,"Birim Fiyatı",null,null,null,"Toplam Fiyatı"]
[{"$f":"IF('BİLGİ GİRİŞİ'!D30=\"\",\"\",'BİLGİ GİRİŞİ'!D30)","v":1},{"$f":"IF('BİLGİ GİRİŞİ'!E30=\"\",\"\",'BİLGİ GİRİŞİ'!E30)","v":"AIO (All In One) Masaüstü Bilgisayar "},null,null,null,null,null,null,null,null,null,null,null,null,null,{"$f":"IF('BİLGİ GİRİŞİ'!W30=\"\",\"\",'BİLGİ GİRİŞİ'!W30)","v":"Adet"},null,null,null,{"$f":"IF('BİLGİ GİRİŞİ'!T30=\"\",\"\",IF('BİLGİ GİRİŞİ'!$BN$28=1,\"1\",'BİLGİ GİRİŞİ'!T30))","v":"1"}]
[{"$f":"IF('BİLGİ GİRİŞİ'!D31=\"\",\"\",'BİLGİ GİRİŞİ'!D31)","v":2},{"$f":"IF('BİLGİ GİRİŞİ'!E31=\"\",\"\",'BİLGİ GİRİŞİ'!E31)","v":"Fotokopi Makinesi"},null,null,null,null,null,null,null,null,null,null,null,null,null,{"$f":"IF('BİLGİ GİRİŞİ'!W31=\"\",\"\",'BİLGİ GİRİŞİ'!W31)","v":"Adet"},null,null,null,{"$f":"IF('BİLGİ GİRİŞİ'!T31=\"\",\"\",IF('BİLGİ GİRİŞİ'!$BN$28=1,\"1\",'BİLGİ GİRİŞİ'!T31))","v":"1"}]
[{"$f":"IF('BİLGİ GİRİŞİ'!D32=\"\",\"\",'BİLGİ GİRİŞİ'!D32)","v":3},{"$f":"IF('BİLGİ GİRİŞİ'!E32=\"\",\"\",'BİLGİ GİRİŞİ'!E32)","v":"Projektör"},null,null,null,null,null,null,null,null,null,null,null,null,null,{"$f":"IF('BİLGİ GİRİŞİ'!W32=\"\",\"\",'BİLGİ GİRİŞİ'!W32)","v":"Adet"},null,null,null,{"$f":"IF('BİLGİ GİRİŞİ'!T32=\"\",\"\",IF('BİLGİ GİRİŞİ'!$BN$28=1,\"1\",'BİLGİ GİRİŞİ'!T32))","v":"1"}]
[{"$f":"IF('BİLGİ GİRİŞİ'!D33=\"\",\"\",'BİLGİ GİRİŞİ'!D33)","v":""},{"$f":"IF('BİLGİ GİRİŞİ'!E33=\"\",\"\",'BİLGİ GİRİŞİ'!E33)","v":""},null,null,null,null,null,null,null,null,null,null,null,null,null,{"$f":"IF('BİLGİ GİRİŞİ'!W33=\"\",\"\",'BİLGİ GİRİŞİ'!W33)","v":""},null,null,null,{"$f":"IF('BİLGİ GİRİŞİ'!T33=\"\",\"\",IF('BİLGİ GİRİŞİ'!$BN$28=1,\"1\",'BİLGİ GİRİŞİ'!T33))","v":""}]
[{"$f":"IF('BİLGİ GİRİŞİ'!D34=\"\",\"\",'BİLGİ GİRİŞİ'!D34)","v":""},{"$f":"IF('BİLGİ GİRİŞİ'!E34=\"\",\"\",'BİLGİ GİRİŞİ'!E34)","v":""},null,null,null,null,null,null,null,null,null,null,null,null,null,{"$f":"IF('BİLGİ GİRİŞİ'!W34=\"\",\"\",'BİLGİ GİRİŞİ'!W34)","v":""},null,null,null,{"$f":"IF('BİLGİ GİRİŞİ'!T34=\"\",\"\",IF('BİLGİ GİRİŞİ'!$BN$28=1,\"1\",'BİLGİ GİRİŞİ'!T34))","v":""}]
[{"$f":"IF('BİLGİ GİRİŞİ'!D35=\"\",\"\",'BİLGİ GİRİŞİ'!D35)","v":""},{"$f":"IF('BİLGİ GİRİŞİ'!E35=\"\",\"\",'BİLGİ GİRİŞİ'!E35)","v":""},null,null,null,null,null,null,null,null,null,null,null,null,null,{"$f":"IF('BİLGİ GİRİŞİ'!W35=\"\",\"\",'BİLGİ GİRİŞİ'!W35)","v":""},null,null,null,{"$f":"IF('BİLGİ GİRİŞİ'!T35=\"\",\"\",IF('BİLGİ GİRİŞİ'!$BN$28=1,\"1\",'BİLGİ GİRİŞİ'!T35))","v":""}]
[{"$f":"IF('BİLGİ GİRİŞİ'!D36=\"\",\"\",'BİLGİ GİRİŞİ'!D36)","v":""},{"$f":"IF('BİLGİ GİRİŞİ'!E36=\"\",\"\",'BİLGİ GİRİŞİ'!E36)","v":""},null,null,null,null,null,null,null,null,null,null,null,null,null,{"$f":"IF('BİLGİ GİRİŞİ'!W36=\"\",\"\",'BİLGİ GİRİŞİ'!W36)","v":""},null,null,null,{"$f":"IF('BİLGİ GİRİŞİ'!T36=\"\",\"\",IF('BİLGİ GİRİŞİ'!$BN$28=1,\"1\",'BİLGİ GİRİŞİ'!T36))","v":""}]
[{"$f":"IF('BİLGİ GİRİŞİ'!D37=\"\",\"\",'BİLGİ GİRİŞİ'!D37)","v":""},{"$f":"IF('BİLGİ GİRİŞİ'!E37=\"\",\"\",'BİLGİ GİRİŞİ'!E37)","v":""},null,null,null,null,null,null,null,null,null,null,null,null,null,{"$f":"IF('BİLGİ GİRİŞİ'!W37=\"\",\"\",'BİLGİ GİRİŞİ'!W37)","v":""},null,null,null,{"$f":"IF('BİLGİ GİRİŞİ'!T37=\"\",\"\",IF('BİLGİ GİRİŞİ'!$BN$28=1,\"1\",'BİLGİ GİRİŞİ'!T37))","v":""}]
[{"$f":"IF('BİLGİ GİRİŞİ'!D38=\"\",\"\",'BİLGİ GİRİŞİ'!D38)","v":""},{"$f":"IF('BİLGİ GİRİŞİ'!E38=\"\",\"\",'BİLGİ GİRİŞİ'!E38)","v":""},null,null,null,null,null,null,null,null,null,null,null,null,null,{"$f":"IF('BİLGİ GİRİŞİ'!W38=\"\",\"\",'BİLGİ GİRİŞİ'!W38)","v":""},null,null,null,{"$f":"IF('BİLGİ GİRİŞİ'!T38=\"\",\"\",IF('BİLGİ GİRİŞİ'!$BN$28=1,\"1\",'BİLGİ GİRİŞİ'!T38))","v":""}]
[{"$f":"IF('BİLGİ GİRİŞİ'!D39=\"\",\"\",'BİLGİ GİRİŞİ'!D39)","v":""},{"$f":"IF('BİLGİ GİRİŞİ'!E39=\"\",\"\",'BİLGİ GİRİŞİ'!E39)","v":""},null,null,null,null,null,null,null,null,null,null,null,null,null,{"$f":"IF('BİLGİ GİRİŞİ'!W39=\"\",\"\",'BİLGİ GİRİŞİ'!W39)","v":""},null,null,null,{"$f":"IF('BİLGİ GİRİŞİ'!T39=\"\",\"\",IF('BİLGİ GİRİŞİ'!$BN$28=1,\"1\",'BİLGİ GİRİŞİ'!T39))","v":""}]
[{"$f":"IF('BİLGİ GİRİŞİ'!D40=\"\",\"\",'BİLGİ GİRİŞİ'!D40)","v":""},{"$f":"IF('BİLGİ GİRİŞİ'!E40=\"\",\"\",'BİLGİ GİRİŞİ'!E40)","v":""},null,null,null,null,null,null,null,null,null,null,null,null,null,{"$f":"IF('BİLGİ GİRİŞİ'!W40=\"\",\"\",'BİLGİ GİRİŞİ'!W40)","v":""},null,null,null,{"$f":"IF('BİLGİ GİRİŞİ'!T40=\"\",\"\",IF('BİLGİ GİRİŞİ'!$BN$28=1,\"1\",'BİLGİ GİRİŞİ'!T40))","v":""}]
[{"$f":"IF('BİLGİ GİRİŞİ'!D41=\"\",\"\",'BİLGİ GİRİŞİ'!D41)","v":""},{"$f":"IF('BİLGİ GİRİŞİ'!E41=\"\",\"\",'BİLGİ GİRİŞİ'!E41)","v":""},null,null,null,null,null,null,null,null,null,null,null,null,null,{"$f":"IF('BİLGİ GİRİŞİ'!W41=\"\",\"\",'BİLGİ GİRİŞİ'!W41)","v":""},null,null,null,{"$f":"IF('BİLGİ GİRİŞİ'!T41=\"\",\"\",IF('BİLGİ GİRİŞİ'!$BN$28=1,\"1\",'BİLGİ GİRİŞİ'!T41))","v":""}]
[{"$f":"IF('BİLGİ GİRİŞİ'!D42=\"\",\"\",'BİLGİ GİRİŞİ'!D42)","v":""},{"$f":"IF('BİLGİ GİRİŞİ'!E42=\"\",\"\",'BİLGİ GİRİŞİ'!E42)","v":""},null,null,null,null,null,null,null,null,null,null,null,null,null,{"$f":"IF('BİLGİ GİRİŞİ'!W42=\"\",\"\",'BİLGİ GİRİŞİ'!W42)","v":""},null,null,null,{"$f":"IF('BİLGİ GİRİŞİ'!T42=\"\",\"\",IF('BİLGİ GİRİŞİ'!$BN$28=1,\"1\",'BİLGİ GİRİŞİ'!T42))","v":""}]
[{"$f":"IF('BİLGİ GİRİŞİ'!D43=\"\",\"\",'BİLGİ GİRİŞİ'!D43)","v":""},{"$f":"IF('BİLGİ GİRİŞİ'!E43=\"\",\"\",'BİLGİ GİRİŞİ'!E43)","v":""},null,null,null,null,null,null,null,null,null,null,null,null,null,{"$f":"IF('BİLGİ GİRİŞİ'!W43=\"\",\"\",'BİLGİ GİRİŞİ'!W43)","v":""},null,null,null,{"$f":"IF('BİLGİ GİRİŞİ'!T43=\"\",\"\",IF('BİLGİ GİRİŞİ'!$BN$28=1,\"1\",'BİLGİ GİRİŞİ'!T43))","v":""}]
[{"$f":"IF('BİLGİ GİRİŞİ'!D44=\"\",\"\",'BİLGİ GİRİŞİ'!D44)","v":""},{"$f":"IF('BİLGİ GİRİŞİ'!E44=\"\",\"\",'BİLGİ GİRİŞİ'!E44)","v":""},null,null,null,null,null,null,null,null,null,null,null,null,null,{"$f":"IF('BİLGİ GİRİŞİ'!W44=\"\",\"\",'BİLGİ GİRİŞİ'!W44)","v":""},null,null,null,{"$f":"IF('BİLGİ GİRİŞİ'!T44=\"\",\"\",IF('BİLGİ GİRİŞİ'!$BN$28=1,\"1\",'BİLGİ GİRİŞİ'!T44))","v":""}]
[{"$f":"IF('BİLGİ GİRİŞİ'!D45=\"\",\"\",'BİLGİ GİRİŞİ'!D45)","v":""},{"$f":"IF('BİLGİ GİRİŞİ'!E45=\"\",\"\",'BİLGİ GİRİŞİ'!E45)","v":""},null,null,null,null,null,null,null,null,null,null,null,null,null,{"$f":"IF('BİLGİ GİRİŞİ'!W45=\"\",\"\",'BİLGİ GİRİŞİ'!W45)","v":""},null,null,null,{"$f":"IF('BİLGİ GİRİŞİ'!T45=\"\",\"\",IF('BİLGİ GİRİŞİ'!$BN$28=1,\"1\",'BİLGİ GİRİŞİ'!T45))","v":""}]
[{"$f":"IF('BİLGİ GİRİŞİ'!D46=\"\",\"\",'BİLGİ GİRİŞİ'!D46)","v":""},{"$f":"IF('BİLGİ GİRİŞİ'!E46=\"\",\"\",'BİLGİ GİRİŞİ'!E46)","v":""},null,null,null,null,null,null,null,null,null,null,null,null,null,{"$f":"IF('BİLGİ GİRİŞİ'!W46=\"\",\"\",'BİLGİ GİRİŞİ'!W46)","v":""},null,null,null,{"$f":"IF('BİLGİ GİRİŞİ'!T46=\"\",\"\",IF('BİLGİ GİRİŞİ'!$BN$28=1,\"1\",'BİLGİ GİRİŞİ'!T46))","v":""}]
[{"$f":"IF('BİLGİ GİRİŞİ'!D47=\"\",\"\",'BİLGİ GİRİŞİ'!D47)","v":""},{"$f":"IF('BİLGİ GİRİŞİ'!E47=\"\",\"\",'BİLGİ GİRİŞİ'!E47)","v":""},null,null,null,null,null,null,null,null,null,null,null,null,null,{"$f":"IF('BİLGİ GİRİŞİ'!W47=\"\",\"\",'BİLGİ GİRİŞİ'!W47)","v":""},null,null,null,{"$f":"IF('BİLGİ GİRİŞİ'!T47=\"\",\"\",IF('BİLGİ GİRİŞİ'!$BN$28=1,\"1\",'BİLGİ GİRİŞİ'!T47))","v":""}]
[{"$f":"IF('BİLGİ GİRİŞİ'!D48=\"\",\"\",'BİLGİ GİRİŞİ'!D48)","v":""},{"$f":"IF('BİLGİ GİRİŞİ'!E48=\"\",\"\",'BİLGİ GİRİŞİ'!E48)","v":""},null,null,null,null,null,null,null,null,null,null,null,null,null,{"$f":"IF('BİLGİ GİRİŞİ'!W48=\"\",\"\",'BİLGİ GİRİŞİ'!W48)","v":""},null,null,null,{"$f":"IF('BİLGİ GİRİŞİ'!T48=\"\",\"\",IF('BİLGİ GİRİŞİ'!$BN$28=1,\"1\",'BİLGİ GİRİŞİ'!T48))","v":""}]
[{"$f":"IF('BİLGİ GİRİŞİ'!D49=\"\",\"\",'BİLGİ GİRİŞİ'!D49)","v":""},{"$f":"IF('BİLGİ GİRİŞİ'!E49=\"\",\"\",'BİLGİ GİRİŞİ'!E49)","v":""},null,null,null,null,null,null,null,null,null,null,null,null,null,{"$f":"IF('BİLGİ GİRİŞİ'!W49=\"\",\"\",'BİLGİ GİRİŞİ'!W49)","v":""},null,null,null,{"$f":"IF('BİLGİ GİRİŞİ'!T49=\"\",\"\",IF('BİLGİ GİRİŞİ'!$BN$28=1,\"1\",'BİLGİ GİRİŞİ'!T49))","v":""}]
[{"$f":"IF('BİLGİ GİRİŞİ'!D50=\"\",\"\",'BİLGİ GİRİŞİ'!D50)","v":""},{"$f":"IF('BİLGİ GİRİŞİ'!E50=\"\",\"\",'BİLGİ GİRİŞİ'!E50)","v":""},null,null,null,null,null,null,null,null,null,null,null,null,null,{"$f":"IF('BİLGİ GİRİŞİ'!W50=\"\",\"\",'BİLGİ GİRİŞİ'!W50)","v":""},null,null,null,{"$f":"IF('BİLGİ GİRİŞİ'!T50=\"\",\"\",IF('BİLGİ GİRİŞİ'!$BN$28=1,\"1\",'BİLGİ GİRİŞİ'!T50))","v":""}]
[{"$f":"IF('BİLGİ GİRİŞİ'!D51=\"\",\"\",'BİLGİ GİRİŞİ'!D51)","v":""},{"$f":"IF('BİLGİ GİRİŞİ'!E51=\"\",\"\",'BİLGİ GİRİŞİ'!E51)","v":""},null,null,null,null,null,null,null,null,null,null,null,null,null,{"$f":"IF('BİLGİ GİRİŞİ'!W51=\"\",\"\",'BİLGİ GİRİŞİ'!W51)","v":""},null,null,null,{"$f":"IF('BİLGİ GİRİŞİ'!T51=\"\",\"\",IF('BİLGİ GİRİŞİ'!$BN$28=1,\"1\",'BİLGİ GİRİŞİ'!T51))","v":""}]
[{"$f":"IF('BİLGİ GİRİŞİ'!D52=\"\",\"\",'BİLGİ GİRİŞİ'!D52)","v":""},{"$f":"IF('BİLGİ GİRİŞİ'!E52=\"\",\"\",'BİLGİ GİRİŞİ'!E52)","v":""},null,null,null,null,null,null,null,null,null,null,null,null,null,{"$f":"IF('BİLGİ GİRİŞİ'!W52=\"\",\"\",'BİLGİ GİRİŞİ'!W52)","v":""},null,null,null,{"$f":"IF('BİLGİ GİRİŞİ'!T52=\"\",\"\",IF('BİLGİ GİRİŞİ'!$BN$28=1,\"1\",'BİLGİ GİRİŞİ'!T52))","v":""}]
[{"$f":"IF('BİLGİ GİRİŞİ'!D53=\"\",\"\",'BİLGİ GİRİŞİ'!D53)","v":""},{"$f":"IF('BİLGİ GİRİŞİ'!E53=\"\",\"\",'BİLGİ GİRİŞİ'!E53)","v":""},null,null,null,null,null,null,null,null,null,null,null,null,null,{"$f":"IF('BİLGİ GİRİŞİ'!W53=\"\",\"\",'BİLGİ GİRİŞİ'!W53)","v":""},null,null,null,{"$f":"IF('BİLGİ GİRİŞİ'!T53=\"\",\"\",IF('BİLGİ GİRİŞİ'!$BN$28=1,\"1\",'BİLGİ GİRİŞİ'!T53))","v":""}]
[{"$f":"IF('BİLGİ GİRİŞİ'!D54=\"\",\"\",'BİLGİ GİRİŞİ'!D54)","v":""},{"$f":"IF('BİLGİ GİRİŞİ'!E54=\"\",\"\",'BİLGİ GİRİŞİ'!E54)","v":""},null,null,null,null,null,null,null,null,null,null,null,null,null,{"$f":"IF('BİLGİ GİRİŞİ'!W54=\"\",\"\",'BİLGİ GİRİŞİ'!W54)","v":""},null,null,null,{"$f":"IF('BİLGİ GİRİŞİ'!T54=\"\",\"\",IF('BİLGİ GİRİŞİ'!$BN$28=1,\"1\",'BİLGİ GİRİŞİ'!T54))","v":""}]
[{"$f":"IF('BİLGİ GİRİŞİ'!D55=\"\",\"\",'BİLGİ GİRİŞİ'!D55)","v":""},{"$f":"IF('BİLGİ GİRİŞİ'!E55=\"\",\"\",'BİLGİ GİRİŞİ'!E55)","v":""},null,null,null,null,null,null,null,null,null,null,null,null,null,{"$f":"IF('BİLGİ GİRİŞİ'!W55=\"\",\"\",'BİLGİ GİRİŞİ'!W55)","v":""},null,null,null,{"$f":"IF('BİLGİ GİRİŞİ'!T55=\"\",\"\",IF('BİLGİ GİRİŞİ'!$BN$28=1,\"1\",'BİLGİ GİRİŞİ'!T55))","v":""}]
[{"$f":"IF('BİLGİ GİRİŞİ'!D56=\"\",\"\",'BİLGİ GİRİŞİ'!D56)","v":""},{"$f":"IF('BİLGİ GİRİŞİ'!E56=\"\",\"\",'BİLGİ GİRİŞİ'!E56)","v":""},null,null,null,null,null,null,null,null,null,null,null,null,null,{"$f":"IF('BİLGİ GİRİŞİ'!W56=\"\",\"\",'BİLGİ GİRİŞİ'!W56)","v":""},null,null,null,{"$f":"IF('BİLGİ GİRİŞİ'!T56=\"\",\"\",IF('BİLGİ GİRİŞİ'!$BN$28=1,\"1\",'BİLGİ GİRİŞİ'!T56))","v":""}]
[{"$f":"IF('BİLGİ GİRİŞİ'!D57=\"\",\"\",'BİLGİ GİRİŞİ'!D57)","v":""},{"$f":"IF('BİLGİ GİRİŞİ'!E57=\"\",\"\",'BİLGİ GİRİŞİ'!E57)","v":""},null,null,null,null,null,null,null,null,null,null,null,null,null,{"$f":"IF('BİLGİ GİRİŞİ'!W57=\"\",\"\",'BİLGİ GİRİŞİ'!W57)","v":""},null,null,null,{"$f":"IF('BİLGİ GİRİŞİ'!T57=\"\",\"\",IF('BİLGİ GİRİŞİ'!$BN$28=1,\"1\",'BİLGİ GİRİŞİ'!T57))","v":""}]
[{"$f":"IF('BİLGİ GİRİŞİ'!D58=\"\",\"\",'BİLGİ GİRİŞİ'!D58)","v":""},{"$f":"IF('BİLGİ GİRİŞİ'!E58=\"\",\"\",'BİLGİ GİRİŞİ'!E58)","v":""},null,null,null,null,null,null,null,null,null,null,null,null,null,{"$f":"IF('BİLGİ GİRİŞİ'!W58=\"\",\"\",'BİLGİ GİRİŞİ'!W58)","v":""},null,null,null,{"$f":"IF('BİLGİ GİRİŞİ'!T58=\"\",\"\",IF('BİLGİ GİRİŞİ'!$BN$28=1,\"1\",'BİLGİ GİRİŞİ'!T58))","v":""}]
[{"$f":"IF('BİLGİ GİRİŞİ'!D59=\"\",\"\",'BİLGİ GİRİŞİ'!D59)","v":""},{"$f":"IF('BİLGİ GİRİŞİ'!E59=\"\",\"\",'BİLGİ GİRİŞİ'!E59)","v":""},null,null,null,null,null,null,null,null,null,null,null,null,null,{"$f":"IF('BİLGİ GİRİŞİ'!W59=\"\",\"\",'BİLGİ GİRİŞİ'!W59)","v":""},null,null,null,{"$f":"IF('BİLGİ GİRİŞİ'!T59=\"\",\"\",IF('BİLGİ GİRİŞİ'!$BN$28=1,\"1\",'BİLGİ GİRİŞİ'!T59))","v":""}]
[{"$f":"IF('BİLGİ GİRİŞİ'!D60=\"\",\"\",'BİLGİ GİRİŞİ'!D60)","v":""},{"$f":"IF('BİLGİ GİRİŞİ'!E60=\"\",\"\",'BİLGİ GİRİŞİ'!E60)","v":""},null,null,null,null,null,null,null,null,null,null,null,null,null,{"$f":"IF('BİLGİ GİRİŞİ'!W60=\"\",\"\",'BİLGİ GİRİŞİ'!W60)","v":""},null,null,null,{"$f":"IF('BİLGİ GİRİŞİ'!T60=\"\",\"\",IF('BİLGİ GİRİŞİ'!$BN$28=1,\"1\",'BİLGİ GİRİŞİ'!T60))","v":""}]
[{"$f":"IF('BİLGİ GİRİŞİ'!D61=\"\",\"\",'BİLGİ GİRİŞİ'!D61)","v":""},{"$f":"IF('BİLGİ GİRİŞİ'!E61=\"\",\"\",'BİLGİ GİRİŞİ'!E61)","v":""},null,null,null,null,null,null,null,null,null,null,null,null,null,{"$f":"IF('BİLGİ GİRİŞİ'!W61=\"\",\"\",'BİLGİ GİRİŞİ'!W61)","v":""},null,null,null,{"$f":"IF('BİLGİ GİRİŞİ'!T61=\"\",\"\",IF('BİLGİ GİRİŞİ'!$BN$28=1,\"1\",'BİLGİ GİRİŞİ'!T61))","v":""}]
[{"$f":"IF('BİLGİ GİRİŞİ'!D62=\"\",\"\",'BİLGİ GİRİŞİ'!D62)","v":""},{"$f":"IF('BİLGİ GİRİŞİ'!E62=\"\",\"\",'BİLGİ GİRİŞİ'!E62)","v":""},null,null,null,null,null,null,null,null,null,null,null,null,null,{"$f":"IF('BİLGİ GİRİŞİ'!W62=\"\",\"\",'BİLGİ GİRİŞİ'!W62)","v":""},null,null,null,{"$f":"IF('BİLGİ GİRİŞİ'!T62=\"\",\"\",IF('BİLGİ GİRİŞİ'!$BN$28=1,\"1\",'BİLGİ GİRİŞİ'!T62))","v":""}]
[{"$f":"IF('BİLGİ GİRİŞİ'!D63=\"\",\"\",'BİLGİ GİRİŞİ'!D63)","v":""},{"$f":"IF('BİLGİ GİRİŞİ'!E63=\"\",\"\",'BİLGİ GİRİŞİ'!E63)","v":""},null,null,null,null,null,null,null,null,null,null,null,null,null,{"$f":"IF('BİLGİ GİRİŞİ'!W63=\"\",\"\",'BİLGİ GİRİŞİ'!W63)","v":""},null,null,null,{"$f":"IF('BİLGİ GİRİŞİ'!T63=\"\",\"\",IF('BİLGİ GİRİŞİ'!$BN$28=1,\"1\",'BİLGİ GİRİŞİ'!T63))","v":""}]
[{"$f":"IF('BİLGİ GİRİŞİ'!D64=\"\",\"\",'BİLGİ GİRİŞİ'!D64)","v":""},{"$f":"IF('BİLGİ GİRİŞİ'!E64=\"\",\"\",'BİLGİ GİRİŞİ'!E64)","v":""},null,null,null,null,null,null,null,null,null,null,null,null,null,{"$f":"IF('BİLGİ GİRİŞİ'!W64=\"\",\"\",'BİLGİ GİRİŞİ'!W64)","v":""},null,null,null,{"$f":"IF('BİLGİ GİRİŞİ'!T64=\"\",\"\",IF('BİLGİ GİRİŞİ'!$BN$28=1,\"1\",'BİLGİ GİRİŞİ'!T64))","v":""}]
[{"$f":"IF('BİLGİ GİRİŞİ'!D65=\"\",\"\",'BİLGİ GİRİŞİ'!D65)","v":""},{"$f":"IF('BİLGİ GİRİŞİ'!E65=\"\",\"\",'BİLGİ GİRİŞİ'!E65)","v":""},null,null,null,null,null,null,null,null,null,null,null,null,null,{"$f":"IF('BİLGİ GİRİŞİ'!W65=\"\",\"\",'BİLGİ GİRİŞİ'!W65)","v":""},null,null,null,{"$f":"IF('BİLGİ GİRİŞİ'!T65=\"\",\"\",IF('BİLGİ GİRİŞİ'!$BN$28=1,\"1\",'BİLGİ GİRİŞİ'!T65))","v":""}]
[{"$f":"IF('BİLGİ GİRİŞİ'!D66=\"\",\"\",'BİLGİ GİRİŞİ'!D66)","v":""},{"$f":"IF('BİLGİ GİRİŞİ'!E66=\"\",\"\",'BİLGİ GİRİŞİ'!E66)","v":""},null,null,null,null,null,null,null,null,null,null,null,null,null,{"$f":"IF('BİLGİ GİRİŞİ'!W66=\"\",\"\",'BİLGİ GİRİŞİ'!W66)","v":""},null,null,null,{"$f":"IF('BİLGİ GİRİŞİ'!T66=\"\",\"\",IF('BİLGİ GİRİŞİ'!$BN$28=1,\"1\",'BİLGİ GİRİŞİ'!T66))","v":""}]
[{"$f":"IF('BİLGİ GİRİŞİ'!D67=\"\",\"\",'BİLGİ GİRİŞİ'!D67)","v":""},{"$f":"IF('BİLGİ GİRİŞİ'!E67=\"\",\"\",'BİLGİ GİRİŞİ'!E67)","v":""},null,null,null,null,null,null,null,null,null,null,null,null,null,{"$f":"IF('BİLGİ GİRİŞİ'!W67=\"\",\"\",'BİLGİ GİRİŞİ'!W67)","v":""},null,null,null,{"$f":"IF('BİLGİ GİRİŞİ'!T67=\"\",\"\",IF('BİLGİ GİRİŞİ'!$BN$28=1,\"1\",'BİLGİ GİRİŞİ'!T67))","v":""}]
[{"$f":"IF('BİLGİ GİRİŞİ'!D68=\"\",\"\",'BİLGİ GİRİŞİ'!D68)","v":""},{"$f":"IF('BİLGİ GİRİŞİ'!E68=\"\",\"\",'BİLGİ GİRİŞİ'!E68)","v":""},null,null,null,null,null,null,null,null,null,null,null,null,null,{"$f":"IF('BİLGİ GİRİŞİ'!W68=\"\",\"\",'BİLGİ GİRİŞİ'!W68)","v":""},null,null,null,{"$f":"IF('BİLGİ GİRİŞİ'!T68=\"\",\"\",IF('BİLGİ GİRİŞİ'!$BN$28=1,\"1\",'BİLGİ GİRİŞİ'!T68))","v":""}]
[{"$f":"IF('BİLGİ GİRİŞİ'!D69=\"\",\"\",'BİLGİ GİRİŞİ'!D69)","v":""},{"$f":"IF('BİLGİ GİRİŞİ'!E69=\"\",\"\",'BİLGİ GİRİŞİ'!E69)","v":""},null,null,null,null,null,null,null,null,null,null,null,null,null,{"$f":"IF('BİLGİ GİRİŞİ'!W69=\"\",\"\",'BİLGİ GİRİŞİ'!W69)","v":""},null,null,null,{"$f":"IF('BİLGİ GİRİŞİ'!T69=\"\",\"\",IF('BİLGİ GİRİŞİ'!$BN$28=1,\"1\",'BİLGİ GİRİŞİ'!T69))","v":""}]
[{"$f":"IF('BİLGİ GİRİŞİ'!D70=\"\",\"\",'BİLGİ GİRİŞİ'!D70)","v":""},{"$f":"IF('BİLGİ GİRİŞİ'!E70=\"\",\"\",'BİLGİ GİRİŞİ'!E70)","v":""},null,null,null,null,null,null,null,null,null,null,null,null,null,{"$f":"IF('BİLGİ GİRİŞİ'!W70=\"\",\"\",'BİLGİ GİRİŞİ'!W70)","v":""},null,null,null,{"$f":"IF('BİLGİ GİRİŞİ'!T70=\"\",\"\",IF('BİLGİ GİRİŞİ'!$BN$28=1,\"1\",'BİLGİ GİRİŞİ'!T70))","v":""}]
[{"$f":"IF('BİLGİ GİRİŞİ'!D71=\"\",\"\",'BİLGİ GİRİŞİ'!D71)","v":""},{"$f":"IF('BİLGİ GİRİŞİ'!E71=\"\",\"\",'BİLGİ GİRİŞİ'!E71)","v":""},null,null,null,null,null,null,null,null,null,null,null,null,null,{"$f":"IF('BİLGİ GİRİŞİ'!W71=\"\",\"\",'BİLGİ GİRİŞİ'!W71)","v":""},null,null,null,{"$f":"IF('BİLGİ GİRİŞİ'!T71=\"\",\"\",IF('BİLGİ GİRİŞİ'!$BN$28=1,\"1\",'BİLGİ GİRİŞİ'!T71))","v":""}]
[{"$f":"IF('BİLGİ GİRİŞİ'!D72=\"\",\"\",'BİLGİ GİRİŞİ'!D72)","v":""},{"$f":"IF('BİLGİ GİRİŞİ'!E72=\"\",\"\",'BİLGİ GİRİŞİ'!E72)","v":""},null,null,null,null,null,null,null,null,null,null,null,null,null,{"$f":"IF('BİLGİ GİRİŞİ'!W72=\"\",\"\",'BİLGİ GİRİŞİ'!W72)","v":""},null,null,null,{"$f":"IF('BİLGİ GİRİŞİ'!T72=\"\",\"\",IF('BİLGİ GİRİŞİ'!$BN$28=1,\"1\",'BİLGİ GİRİŞİ'!T72))","v":""}]
[{"$f":"IF('BİLGİ GİRİŞİ'!D73=\"\",\"\",'BİLGİ GİRİŞİ'!D73)","v":""},{"$f":"IF('BİLGİ GİRİŞİ'!E73=\"\",\"\",'BİLGİ GİRİŞİ'!E73)","v":""},null,null,null,null,null,null,null,null,null,null,null,null,null,{"$f":"IF('BİLGİ GİRİŞİ'!W73=\"\",\"\",'BİLGİ GİRİŞİ'!W73)","v":""},null,null,null,{"$f":"IF('BİLGİ GİRİŞİ'!T73=\"\",\"\",IF('BİLGİ GİRİŞİ'!$BN$28=1,\"1\",'BİLGİ GİRİŞİ'!T73))","v":""}]
[{"$f":"IF('BİLGİ GİRİŞİ'!D74=\"\",\"\",'BİLGİ GİRİŞİ'!D74)","v":""},{"$f":"IF('BİLGİ GİRİŞİ'!E74=\"\",\"\",'BİLGİ GİRİŞİ'!E74)","v":""},null,null,null,null,null,null,null,null,null,null,null,null,null,{"$f":"IF('BİLGİ GİRİŞİ'!W74=\"\",\"\",'BİLGİ GİRİŞİ'!W74)","v":""},null,null,null,{"$f":"IF('BİLGİ GİRİŞİ'!T74=\"\",\"\",IF('BİLGİ GİRİŞİ'!$BN$28=1,\"1\",'BİLGİ GİRİŞİ'!T74))","v":""}]
[{"$f":"IF('BİLGİ GİRİŞİ'!D75=\"\",\"\",'BİLGİ GİRİŞİ'!D75)","v":""},{"$f":"IF('BİLGİ GİRİŞİ'!E75=\"\",\"\",'BİLGİ GİRİŞİ'!E75)","v":""},null,null,null,null,null,null,null,null,null,null,null,null,null,{"$f":"IF('BİLGİ GİRİŞİ'!W75=\"\",\"\",'BİLGİ GİRİŞİ'!W75)","v":""},null,null,null,{"$f":"IF('BİLGİ GİRİŞİ'!T75=\"\",\"\",IF('BİLGİ GİRİŞİ'!$BN$28=1,\"1\",'BİLGİ GİRİŞİ'!T75))","v":""}]
[{"$f":"IF('BİLGİ GİRİŞİ'!D76=\"\",\"\",'BİLGİ GİRİŞİ'!D76)","v":""},{"$f":"IF('BİLGİ GİRİŞİ'!E76=\"\",\"\",'BİLGİ GİRİŞİ'!E76)","v":""},null,null,null,null,null,null,null,null,null,null,null,null,null,{"$f":"IF('BİLGİ GİRİŞİ'!W76=\"\",\"\",'BİLGİ GİRİŞİ'!W76)","v":""},null,null,null,{"$f":"IF('BİLGİ GİRİŞİ'!T76=\"\",\"\",IF('BİLGİ GİRİŞİ'!$BN$28=1,\"1\",'BİLGİ GİRİŞİ'!T76))","v":""}]
[{"$f":"IF('BİLGİ GİRİŞİ'!D77=\"\",\"\",'BİLGİ GİRİŞİ'!D77)","v":""},{"$f":"IF('BİLGİ GİRİŞİ'!E77=\"\",\"\",'BİLGİ GİRİŞİ'!E77)","v":""},null,null,null,null,null,null,null,null,null,null,null,null,null,{"$f":"IF('BİLGİ GİRİŞİ'!W77=\"\",\"\",'BİLGİ GİRİŞİ'!W77)","v":""},null,null,null,{"$f":"IF('BİLGİ GİRİŞİ'!T77=\"\",\"\",IF('BİLGİ GİRİŞİ'!$BN$28=1,\"1\",'BİLGİ GİRİŞİ'!T77))","v":""}]
[{"$f":"IF('BİLGİ GİRİŞİ'!D78=\"\",\"\",'BİLGİ GİRİŞİ'!D78)","v":""},{"$f":"IF('BİLGİ GİRİŞİ'!E78=\"\",\"\",'BİLGİ GİRİŞİ'!E78)","v":""},null,null,null,null,null,null,null,null,null,null,null,null,null,{"$f":"IF('BİLGİ GİRİŞİ'!W78=\"\",\"\",'BİLGİ GİRİŞİ'!W78)","v":""},null,null,null,{"$f":"IF('BİLGİ GİRİŞİ'!T78=\"\",\"\",IF('BİLGİ GİRİŞİ'!$BN$28=1,\"1\",'BİLGİ GİRİŞİ'!T78))","v":""}]
[{"$f":"IF('BİLGİ GİRİŞİ'!D79=\"\",\"\",'BİLGİ GİRİŞİ'!D79)","v":""},{"$f":"IF('BİLGİ GİRİŞİ'!E79=\"\",\"\",'BİLGİ GİRİŞİ'!E79)","v":""},null,null,null,null,null,null,null,null,null,null,null,null,null,{"$f":"IF('BİLGİ GİRİŞİ'!W79=\"\",\"\",'BİLGİ GİRİŞİ'!W79)","v":""},null,null,null,{"$f":"IF('BİLGİ GİRİŞİ'!T79=\"\",\"\",IF('BİLGİ GİRİŞİ'!$BN$28=1,\"1\",'BİLGİ GİRİŞİ'!T79))","v":""}]
[{"$f":"IF('BİLGİ GİRİŞİ'!D80=\"\",\"\",'BİLGİ GİRİŞİ'!D80)","v":""},{"$f":"IF('BİLGİ GİRİŞİ'!E80=\"\",\"\",'BİLGİ GİRİŞİ'!E80)","v":""},null,null,null,null,null,null,null,null,null,null,null,null,null,{"$f":"IF('BİLGİ GİRİŞİ'!W80=\"\",\"\",'BİLGİ GİRİŞİ'!W80)","v":""},null,null,null,{"$f":"IF('BİLGİ GİRİŞİ'!T80=\"\",\"\",IF('BİLGİ GİRİŞİ'!$BN$28=1,\"1\",'BİLGİ GİRİŞİ'!T80))","v":""}]
[{"$f":"IF('BİLGİ GİRİŞİ'!D81=\"\",\"\",'BİLGİ GİRİŞİ'!D81)","v":""},{"$f":"IF('BİLGİ GİRİŞİ'!E81=\"\",\"\",'BİLGİ GİRİŞİ'!E81)","v":""},null,null,null,null,null,null,null,null,null,null,null,null,null,{"$f":"IF('BİLGİ GİRİŞİ'!W81=\"\",\"\",'BİLGİ GİRİŞİ'!W81)","v":""},null,null,null,{"$f":"IF('BİLGİ GİRİŞİ'!T81=\"\",\"\",IF('BİLGİ GİRİŞİ'!$BN$28=1,\"1\",'BİLGİ GİRİŞİ'!T81))","v":""}]
[{"$f":"IF('BİLGİ GİRİŞİ'!D82=\"\",\"\",'BİLGİ GİRİŞİ'!D82)","v":""},{"$f":"IF('BİLGİ GİRİŞİ'!E82=\"\",\"\",'BİLGİ GİRİŞİ'!E82)","v":""},null,null,null,null,null,null,null,null,null,null,null,null,null,{"$f":"IF('BİLGİ GİRİŞİ'!W82=\"\",\"\",'BİLGİ GİRİŞİ'!W82)","v":""},null,null,null,{"$f":"IF('BİLGİ GİRİŞİ'!T82=\"\",\"\",IF('BİLGİ GİRİŞİ'!$BN$28=1,\"1\",'BİLGİ GİRİŞİ'!T82))","v":""}]
[{"$f":"IF('BİLGİ GİRİŞİ'!D83=\"\",\"\",'BİLGİ GİRİŞİ'!D83)","v":""},{"$f":"IF('BİLGİ GİRİŞİ'!E83=\"\",\"\",'BİLGİ GİRİŞİ'!E83)","v":""},null,null,null,null,null,null,null,null,null,null,null,null,null,{"$f":"IF('BİLGİ GİRİŞİ'!W83=\"\",\"\",'BİLGİ GİRİŞİ'!W83)","v":""},null,null,null,{"$f":"IF('BİLGİ GİRİŞİ'!T83=\"\",\"\",IF('BİLGİ GİRİŞİ'!$BN$28=1,\"1\",'BİLGİ GİRİŞİ'!T83))","v":""}]
[{"$f":"IF('BİLGİ GİRİŞİ'!D84=\"\",\"\",'BİLGİ GİRİŞİ'!D84)","v":""},{"$f":"IF('BİLGİ GİRİŞİ'!E84=\"\",\"\",'BİLGİ GİRİŞİ'!E84)","v":""},null,null,null,null,null,null,null,null,null,null,null,null,null,{"$f":"IF('BİLGİ GİRİŞİ'!W84=\"\",\"\",'BİLGİ GİRİŞİ'!W84)","v":""},null,null,null,{"$f":"IF('BİLGİ GİRİŞİ'!T84=\"\",\"\",IF('BİLGİ GİRİŞİ'!$BN$28=1,\"1\",'BİLGİ GİRİŞİ'!T84))","v":""}]
[{"$f":"IF('BİLGİ GİRİŞİ'!D85=\"\",\"\",'BİLGİ GİRİŞİ'!D85)","v":""},{"$f":"IF('BİLGİ GİRİŞİ'!E85=\"\",\"\",'BİLGİ GİRİŞİ'!E85)","v":""},null,null,null,null,null,null,null,null,null,null,null,null,null,{"$f":"IF('BİLGİ GİRİŞİ'!W85=\"\",\"\",'BİLGİ GİRİŞİ'!W85)","v":""},null,null,null,{"$f":"IF('BİLGİ GİRİŞİ'!T85=\"\",\"\",IF('BİLGİ GİRİŞİ'!$BN$28=1,\"1\",'BİLGİ GİRİŞİ'!T85))","v":""}]
[{"$f":"IF('BİLGİ GİRİŞİ'!D86=\"\",\"\",'BİLGİ GİRİŞİ'!D86)","v":""},{"$f":"IF('BİLGİ GİRİŞİ'!E86=\"\",\"\",'BİLGİ GİRİŞİ'!E86)","v":""},null,null,null,null,null,null,null,null,null,null,null,null,null,{"$f":"IF('BİLGİ GİRİŞİ'!W86=\"\",\"\",'BİLGİ GİRİŞİ'!W86)","v":""},null,null,null,{"$f":"IF('BİLGİ GİRİŞİ'!T86=\"\",\"\",IF('BİLGİ GİRİŞİ'!$BN$28=1,\"1\",'BİLGİ GİRİŞİ'!T86))","v":""}]
[{"$f":"IF('BİLGİ GİRİŞİ'!D87=\"\",\"\",'BİLGİ GİRİŞİ'!D87)","v":""},{"$f":"IF('BİLGİ GİRİŞİ'!E87=\"\",\"\",'BİLGİ GİRİŞİ'!E87)","v":""},null,null,null,null,null,null,null,null,null,null,null,null,null,{"$f":"IF('BİLGİ GİRİŞİ'!W87=\"\",\"\",'BİLGİ GİRİŞİ'!W87)","v":""},null,null,null,{"$f":"IF('BİLGİ GİRİŞİ'!T87=\"\",\"\",IF('BİLGİ GİRİŞİ'!$BN$28=1,\"1\",'BİLGİ GİRİŞİ'!T87))","v":""}]
[{"$f":"IF('BİLGİ GİRİŞİ'!D88=\"\",\"\",'BİLGİ GİRİŞİ'!D88)","v":""},{"$f":"IF('BİLGİ GİRİŞİ'!E88=\"\",\"\",'BİLGİ GİRİŞİ'!E88)","v":""},null,null,null,null,null,null,null,null,null,null,null,null,null,{"$f":"IF('BİLGİ GİRİŞİ'!W88=\"\",\"\",'BİLGİ GİRİŞİ'!W88)","v":""},null,null,null,{"$f":"IF('BİLGİ GİRİŞİ'!T88=\"\",\"\",IF('BİLGİ GİRİŞİ'!$BN$28=1,\"1\",'BİLGİ GİRİŞİ'!T88))","v":""}]
[{"$f":"IF('BİLGİ GİRİŞİ'!D89=\"\",\"\",'BİLGİ GİRİŞİ'!D89)","v":""},{"$f":"IF('BİLGİ GİRİŞİ'!E89=\"\",\"\",'BİLGİ GİRİŞİ'!E89)","v":""},null,null,null,null,null,null,null,null,null,null,null,null,null,{"$f":"IF('BİLGİ GİRİŞİ'!W89=\"\",\"\",'BİLGİ GİRİŞİ'!W89)","v":""},null,null,null,{"$f":"IF('BİLGİ GİRİŞİ'!T89=\"\",\"\",IF('BİLGİ GİRİŞİ'!$BN$28=1,\"1\",'BİLGİ GİRİŞİ'!T89))","v":""}]
["TOPLAM (KDV Hariç)"]
[]
[null,null,null,null,null,null,null,null,null,null,null,null,null,null,null,null,null,null,null,null,"KİŞİ/FİRMA KAŞE/İMZA"]

{"sheet":"3","index":4,"n_rows":85,"n_cols":45,"rows_kept":85,"cut":false,"hidden":false,"merged":[[72,41,72,43],[72,44,72,46],[73,1,73,14],[73,15,73,18],[73,19,73,22],[73,23,73,25],[73,26,73,28],[73,29,73,31],[73,32,73,34],[73,35,73,37],[73,38,73,40],[73,41,73,43],[73,44,73,46],[72,1,72,14],[72,15,72,18],[72,19,72,22],[72,23,72,25],[72,26,72,28],[72,29,72,31],[72,32,72,34],[72,35,72,37],[72,38,72,40],[70,41,70,43],[70,44,70,46],[71,1,71,14],[71,15,71,18],[71,19,71,22],[71,23,71,25],[71,26,71,28],[71,29,71,31],[71,32,71,34],[71,35,71,37],[71,38,71,40],[71,41,71,43],[71,44,71,46],[70,1,70,14],[70,15,70,18],[70,19,70,22],[70,23,70,25],[70,26,70,28],[70,29,70,31],[70,32,70,34],[70,35,70,37],[70,38,70,40],[68,41,68,43],[68,44,68,46],[69,1,69,14],[69,15,69,18],[69,19,69,22],[69,23,69,25],[69,26,69,28],[69,29,69,31],[69,32,69,34],[69,35,69,37],[69,38,69,40],[69,41,69,43],[69,44,69,46],[68,1,68,14],[68,15,68,18],[68,19,68,22],[68,23,68,25],[68,26,68,28],[68,29,68,31],[68,32,68,34],[68,35,68,37],[68,38,68,40],[66,41,66,43],[66,44,66,46],[67,1,67,14],[67,15,67,18],[67,19,67,22],[67,23,67,25],[67,26,67,28],[67,29,67,31],[67,32,67,34],[67,35,67,37],[67,38,67,40],[67,41,67,43],[67,44,67,46],[66,1,66,14],[66,15,66,18],[66,19,66,22],[66,23,66,25],[66,26,66,28],[66,29,66,31],[66,32,66,34],[66,35,66,37],[66,38,66,40],[64,41,64,43],[64,44,64,46],[65,1,65,14],[65,15,65,18],[65,19,65,22],[65,23,65,25],[65,26,65,28],[65,29,65,31],[65,32,65,34],[65,35,65,37],[65,38,65,40],[65,41,65,43],[65,44,65,46],[64,1,64,14],[64,15,64,18],[64,19,64,22],[64,23,64,25],[64,26,64,28],[64,29,64,31],[64,32,64,34],[64,35,64,37],[64,38,64,40],[62,41,62,43],[62,44,62,46],[63,1,63,14],[63,15,63,18],[63,19,63,22],[63,23,63,25],[63,26,63,28],[63,29,63,31],[63,32,63,34],[63,35,63,37],[63,38,63,40],[63,41,63,43],[63,44,63,46],[62,1,62,14],[62,15,62,18],[62,19,62,22],[62,23,62,25],[62,26,62,28],[62,29,62,31],[62,32,62,34],[62,35,62,37],[62,38,62,40],[60,41,60,43],[60,44,60,46],[61,1,61,14],[61,15,61,18],[61,19,61,22],[61,23,61,25],[61,26,61,28],[61,29,61,31],[61,32,61,34],[61,35,61,37],[61,38,61,40],[61,41,61,43],[61,44,61,46],[60,1,60,14],[60,15,60,18],[60,19,60,22],[60,23,60,25],[60,26,60,28],[60,29,60,31],[60,32,60,34],[60,35,60,37],[60,38,60,40],[58,41,58,43],[58,44,58,46],[59,1,59,14],[59,15,59,18],[59,19,59,22],[59,23,59,25],[59,26,59,28],[59,29,59,31],[59,32,59,34],[59,35,59,37],[59,38,59,40],[59,41,59,43],[59,44,59,46],[58,1,58,14],[58,15,58,18],[58,19,58,22],[58,23,58,25],[58,26,58,28],[58,29,58,31],[58,32,58,34],[58,35,58,37],[58,38,58,40],[56,41,56,43],[56,44,56,46],[57,1,57,14],[57,15,57,18],[57,19,57,22],[57,23,57,25],[57,26,57,28],[57,29,57,31],[57,32,57,34],[57,35,57,37],[57,38,57,40],[57,41,57,43],[57,44,57,46],[56,1,56,14],[56,15,56,18],[56,19,56,22],[56,23,56,25],[56,26,56,28],[56,29,56,31],[56,32,56,34],[56,35,56,37],[56,38,56,40],[54,41,54,43],[54,44,54,46],[55,1,55,14],[55,15,55,18],[55,19,55,22],[55,23,55,25],[55,26,55,28],[55,29,55,31],[55,32,55,34],[55,35,55,37],[55,38,55,40],[55,41,55,43],[55,44,55,46],[54,1,54,14],[54,15,54,18],[54,19,54,22],[54,23,54,25],[54,26,54,28],[54,29,54,31],[54,32,54,34],[54,35,54,37],[54,38,54,40],[84,34,84,46],[83,34,83,46],[81,34,81,46],[80,34,80,46],[80,23,80,33],[83,12,83,22],[83,23,83,33],[84,1,84,11],[84,12,84,22],[84,23,84,33],[83,1,83,11],[75,44,75,46],[77,0,77,17],[77,18,77,23],[77,24,77,46],[80,1,80,11],[74,29,74,31],[74,32,74,34],[74,35,74,37],[74,38,74,40],[74,41,74,43],[74,44,74,46],[80,12,80,22],[75,0,75,22],[75,23,75,25],[75,26,75,28],[75,29,75,31],[75,32,75,34],[75,35,75,37],[75,38,75,40],[75,41,75,43],[33,32,33,34],[33,35,33,37],[33,38,33,40],[33,41,33,43],[33,44,33,46],[74,1,74,14],[74,15,74,18],[74,19,74,22],[74,23,74,25],[74,26,74,28],[33,1,33,14],[33,15,33,18],[33,19,33,22],[33,23,33,25],[33,26,33,28],[33,29,33,31],[34,1,34,14],[35,1,35,14],[36,1,36,14],[37,1,37,14],[38,1,38,14],[39,1,39,14],[40,1,40,14],[41,1,41,14],[32,29,32,31],[32,32,32,34],[32,35,32,37],[32,38,32,40],[32,41,32,43],[32,44,32,46],[31,32,31,34],[31,35,31,37],[31,38,31,40],[31,41,31,43],[31,44,31,46],[31,29,31,31],[32,1,32,14],[32,15,32,18],[32,19,32,22],[32,23,32,25],[32,26,32,28],[31,1,31,14],[31,15,31,18],[31,19,31,22],[31,23,31,25],[31,26,31,28],[30,29,30,31],[30,32,30,34],[30,35,30,37],[30,38,30,40],[30,41,30,43],[30,44,30,46],[29,32,29,34],[29,35,29,37],[29,38,29,40],[29,41,29,43],[29,44,29,46],[29,29,29,31],[30,1,30,14],[30,15,30,18],[30,19,30,22],[30,23,30,25],[30,26,30,28],[29,1,29,14],[29,15,29,18],[29,19,29,22],[29,23,29,25],[29,26,29,28],[28,29,28,31],[28,32,28,34],[28,35,28,37],[28,38,28,40],[28,41,28,43],[28,44,28,46],[27,32,27,34],[27,35,27,37],[27,38,27,40],[27,41,27,43],[27,44,27,46],[27,29,27,31],[28,1,28,14],[28,15,28,18],[28,19,28,22],[28,23,28,25],[28,26,28,28],[27,1,27,14],[27,15,27,18],[27,19,27,22],[27,23,27,25],[27,26,27,28],[26,29,26,31],[26,32,26,34],[26,35,26,37],[26,38,26,40],[26,41,26,43],[26,44,26,46],[25,32,25,34],[25,35,25,37],[25,38,25,40],[25,41,25,43],[25,44,25,46],[25,29,25,31],[26,1,26,14],[26,15,26,18],[26,19,26,22],[26,23,26,25],[26,26,26,28],[25,1,25,14],[25,15,25,18],[25,19,25,22],[25,23,25,25],[25,26,25,28],[24,29,24,31],[24,32,24,34],[24,35,24,37],[24,38,24,40],[24,41,24,43],[24,44,24,46],[23,32,23,34],[23,35,23,37],[23,38,23,40],[23,41,23,43],[23,44,23,46],[23,29,23,31],[24,1,24,14],[24,15,24,18],[24,19,24,22],[24,23,24,25],[24,26,24,28],[23,1,23,14],[23,15,23,18],[23,19,23,22],[23,23,23,25],[23,26,23,28],[22,29,22,31],[22,32,22,34],[22,35,22,37],[22,38,22,40],[22,41,22,43],[22,44,22,46],[21,32,21,34],[21,35,21,37],[21,38,21,40],[21,41,21,43],[21,44,21,46],[21,29,21,31],[22,1,22,14],[22,15,22,18],[22,19,22,22],[22,23,22,25],[22,26,22,28],[21,1,21,14],[21,15,21,18],[21,19,21,22],[21,23,21,25],[21,26,21,28],[17,41,17,43],[17,44,17,46],[20,1,20,14],[20,15,20,18],[20,19,20,22],[20,23,20,25],[20,26,20,28],[19,1,19,14],[19,15,19,18],[19,19,19,22],[19,23,19,25],[19,26,19,28],[20,29,20,31],[20,32,20,34],[20,35,20,37],[20,38,20,40],[20,41,20,43],[20,44,20,46],[19,32,19,34],[19,35,19,37],[19,38,19,40],[19,41,19,43],[19,44,19,46],[19,29,19,31],[18,1,18,14],[18,15,18,18],[18,19,18,22],[18,23,18,25],[18,26,18,28],[16,35,16,37],[16,38,16,40],[16,41,16,43],[16,44,16,46],[17,1,17,14],[17,19,17,22],[17,15,17,18],[17,23,17,25],[17,26,17,28],[17,29,17,31],[18,29,18,31],[18,32,18,34],[18,35,18,37],[18,38,18,40],[18,41,18,43],[18,44,18,46],[17,32,17,34],[17,35,17,37],[17,38,17,40],[15,41,15,43],[15,44,15,46],[16,1,16,14],[16,19,16,22],[16,15,16,18],[16,23,16,25],[16,26,16,28],[16,29,16,31],[16,32,16,34],[15,1,15,14],[15,19,15,22],[15,15,15,18],[15,23,15,25],[15,26,15,28],[15,29,15,31],[15,32,15,34],[15,35,15,37],[15,38,15,40],[13,1,14,14],[13,15,14,18],[14,41,14,43],[14,44,14,46],[13,19,14,22],[13,23,13,28],[13,29,13,34],[13,35,13,40],[14,23,14,25],[14,26,14,28],[14,29,14,31],[14,32,14,34],[14,35,14,37],[14,38,14,40],[43,1,43,14],[44,1,44,14],[45,1,45,14],[46,1,46,14],[47,1,47,14],[48,1,48,14],[49,1,49,14],[50,1,50,14],[1,0,1,46],[3,0,3,9],[3,11,3,41],[3,42,3,46],[5,0,5,9],[5,11,5,46],[6,0,6,9],[6,11,6,14],[6,16,6,46],[4,0,4,9],[4,11,4,46],[8,0,10,46],[12,0,12,22],[12,23,12,40],[12,41,13,46],[13,0,14,0],[51,1,51,14],[52,1,52,14],[53,1,53,14],[34,15,34,18],[35,15,35,18],[36,15,36,18],[37,15,37,18],[38,15,38,18],[39,15,39,18],[40,15,40,18],[41,15,41,18],[42,15,42,18],[43,15,43,18],[44,15,44,18],[45,15,45,18],[46,15,46,18],[47,15,47,18],[48,15,48,18],[49,15,49,18],[50,15,50,18],[51,15,51,18],[52,15,52,18],[53,15,53,18],[42,1,42,14],[34,19,34,22],[35,19,35,22],[36,19,36,22],[37,19,37,22],[38,19,38,22],[39,19,39,22],[40,19,40,22],[41,19,41,22],[42,19,42,22],[43,19,43,22],[44,19,44,22],[45,19,45,22],[46,19,46,22],[47,19,47,22],[48,19,48,22],[49,19,49,22],[50,19,50,22],[51,19,51,22],[52,19,52,22],[53,19,53,22],[34,23,34,25],[34,26,34,28],[34,29,34,31],[34,32,34,34],[34,35,34,37],[34,38,34,40],[34,41,34,43],[36,23,36,25],[36,26,36,28],[36,29,36,31],[36,32,36,34],[36,35,36,37],[36,38,36,40],[36,41,36,43],[38,23,38,25],[38,26,38,28],[38,29,38,31],[38,32,38,34],[38,35,38,37],[38,38,38,40],[38,41,38,43],[40,23,40,25],[34,44,34,46],[35,23,35,25],[35,26,35,28],[35,29,35,31],[35,32,35,34],[35,35,35,37],[35,38,35,40],[35,41,35,43],[35,44,35,46],[36,44,36,46],[37,23,37,25],[37,26,37,28],[37,29,37,31],[37,32,37,34],[37,35,37,37],[37,38,37,40],[37,41,37,43],[37,44,37,46],[38,44,38,46],[39,23,39,25],[39,26,39,28],[39,29,39,31],[39,32,39,34],[39,35,39,37],[39,38,39,40],[39,41,39,43],[39,44,39,46],[40,26,40,28],[40,29,40,31],[40,32,40,34],[40,35,40,37],[40,38,40,40],[40,41,40,43],[40,44,40,46],[41,23,41,25],[41,26,41,28],[41,29,41,31],[41,32,41,34],[41,35,41,37],[41,38,41,40],[41,41,41,43],[41,44,41,46],[42,23,42,25],[42,26,42,28],[42,29,42,31],[42,32,42,34],[42,35,42,37],[42,38,42,40],[42,41,42,43],[42,44,42,46],[43,23,43,25],[43,26,43,28],[43,29,43,31],[43,32,43,34],[43,35,43,37],[43,38,43,40],[43,41,43,43],[43,44,43,46],[44,23,44,25],[44,26,44,28],[44,29,44,31],[44,32,44,34],[44,35,44,37],[44,38,44,40],[44,41,44,43],[44,44,44,46],[45,23,45,25],[45,26,45,28],[45,29,45,31],[45,32,45,34],[45,35,45,37],[45,38,45,40],[45,41,45,43],[45,44,45,46],[46,23,46,25],[46,26,46,28],[46,29,46,31],[46,32,46,34],[46,35,46,37],[46,38,46,40],[46,41,46,43],[46,44,46,46],[47,23,47,25],[47,26,47,28],[47,29,47,31],[47,32,47,34],[47,35,47,37],[47,38,47,40],[47,41,47,43],[47,44,47,46],[48,23,48,25],[48,26,48,28],[48,29,48,31],[48,32,48,34],[48,35,48,37],[48,38,48,40],[48,41,48,43],[48,44,48,46],[49,23,49,25],[49,26,49,28],[49,29,49,31],[49,32,49,34],[49,35,49,37],[49,38,49,40],[49,41,49,43],[49,44,49,46],[50,23,50,25],[50,26,50,28],[50,29,50,31],[50,32,50,34],[50,35,50,37],[50,38,50,40],[50,41,50,43],[50,44,50,46],[51,23,51,25],[51,26,51,28],[51,29,51,31],[51,32,51,34],[51,35,51,37],[51,38,51,40],[51,41,51,43],[51,44,51,46],[52,23,52,25],[52,26,52,28],[52,29,52,31],[52,32,52,34],[52,35,52,37],[52,38,52,40],[52,41,52,43],[52,44,52,46],[53,23,53,25],[53,26,53,28],[53,29,53,31],[53,32,53,34],[53,35,53,37],[53,38,53,40],[53,41,53,43],[53,44,53,46]]}
[]
["YAKLAŞIK MALİYET HESAP CETVELİ"]
[]
["İdarenin Adı",null,null,null,null,null,null,null,null,null,":",{"$f":"IF('BİLGİ GİRİŞİ'!O8=\"\",\"\",'BİLGİ GİRİŞİ'!O8)","v":"Atatürk İlkokulu Müdürlüğü"},null,null,null,null,null,null,null,null,null,null,null,null,null,null,null,null,null,null,null,null,null,null,null,null,null,null,null,null,null,null,{"$f":"IF('BİLGİ GİRİŞİ'!O17=\"\",\"….../….../….…..\",'BİLGİ GİRİŞİ'!O17)","v":"2023-03-07"}]
["Doğrudan Temin Numarası",null,null,null,null,null,null,null,null,null,":",{"$f":"IF('BİLGİ GİRİŞİ'!O11=\"\",\"\",'BİLGİ GİRİŞİ'!O11)","v":"22DT1211930"}]
["Mal/Hizmet/Yapım Adı, Niteliği ",null,null,null,null,null,null,null,null,null,":",{"$f":"IF('BİLGİ GİRİŞİ'!O9=\"\",\"\",'BİLGİ GİRİŞİ'!O9)","v":"Bilişim Malzemeleri Alımı"}]
["Alım/Görevlendirme Onay Tarihi/sayısı",null,null,null,null,null,null,null,null,null,":",{"$f":"IF('BİLGİ GİRİŞİ'!O15=\"\",\"\",'BİLGİ GİRİŞİ'!O15)","v":"2023-03-06"},null,null,null,"/",{"$f":"IF('BİLGİ GİRİŞİ'!S15=\"\",\"\",'BİLGİ GİRİŞİ'!S15)","v":456789123}]
[]
[{"$f":"CONCATENATE(\"       \",\"Kurumumuz ihtiyaçlarında kullanılmak üzere aşağıda bilgileri verilen  Mal/Hizmet/Yapım İşi,  Kamu İhale Kanunu'nun \",IF('BİLGİ GİRİŞİ'!O10=\"\",\".............................................................................\",'BİLGİ GİRİŞİ'!O10),\" maddesine göre Doğrudan Temin yoluyla satın alınmak üzere piyasa fiyat araştırması yapılmış olup verilen fiyatlar ve yaklaşık maliyet aşağıya çıkarılmıştır.\")","v":"       Kurumumuz ihtiyaçlarında kullanılmak üzere aşağıda bilgileri verilen  Mal/Hizmet/Yapım İşi,  Kamu İhale Kanunu'nun 22/d maddesine göre Doğrudan Temin yoluyla satın alınmak üzere piyasa fiyat araştırması yapılmış olup verilen fiyatlar ve yaklaşık maliyet aşağıya çıkarılmıştır."}]
[]
[]
[]
["MAL'IN/HİZMET'İN/YAPIM İŞİ'NİN",null,null,null,null,null,null,null,null,null,null,null,null,null,null,null,null,null,null,null,null,null,null,"TEKLİF VEREN KİŞİLER/FİRMALAR VE TEKLİF FİYATLARI ",null,null,null,null,null,null,null,null,null,null,null,null,null,null,null,null,null,"YAKLAŞIK MALİYET"]
["S","Kalem/KısımBilgileri",null,null,null,null,null,null,null,null,null,null,null,null,null,"Birimi",null,null,null,"Miktarı",null,null,null,{"$f":"IF('BİLGİ GİRİŞİ'!AB28=\"\",\"\",'BİLGİ GİRİŞİ'!AB28)","v":"A GERÇEK/TÜZEL KİŞİSİ"},null,null,null,null,null,{"$f":"IF('BİLGİ GİRİŞİ'!AJ28=\"\",\"\",'BİLGİ GİRİŞİ'!AJ28)","v":"B GERÇEK/TÜZEL KİŞİSİ"},null,null,null,null,null,{"$f":"IF('BİLGİ GİRİŞİ'!AR28=\"\",\"\",'BİLGİ GİRİŞİ'!AR28)","v":"C GERÇEK/TÜZEL KİŞİSİ"}]
[null,null,null,null,null,null,null,null,null,null,null,null,null,null,null,null,null,null,null,null,null,null,null,"Birim Fiyat",null,null,"Toplam Fiyat",null,null,"Birim Fiyat",null,null,"Toplam Fiyat",null,null,"Birim Fiyat",null,null,"Toplam Fiyat",null,null,"Birim Fiyat",null,null,"Toplam Fiyat"]
[{"$f":"IF('BİLGİ GİRİŞİ'!D30=\"\",\"\",'BİLGİ GİRİŞİ'!D30)","v":1},{"$f":"IF('BİLGİ GİRİŞİ'!E30=\"\",\"\",'BİLGİ GİRİŞİ'!E30)","v":"AIO (All In One) Masaüstü Bilgisayar "},null,null,null,null,null,null,null,null,null,null,null,null,null,{"$f":"IF('BİLGİ GİRİŞİ'!W30=\"\",\"\",'BİLGİ GİRİŞİ'!W30)","v":"Adet"},null,null,null,{"$f":"IF('BİLGİ GİRİŞİ'!T30=\"\",\"\",'BİLGİ GİRİŞİ'!T30)","v":2},null,null,null,{"$f":"IF('BİLGİ GİRİŞİ'!AB30=\"\",\"\",'BİLGİ GİRİŞİ'!AB30)","v":2000},null,null,{"$f":"IF('BİLGİ GİRİŞİ'!AF30=\"\",\"\",'BİLGİ GİRİŞİ'!AF30)","v":4000},null,null,{"$f":"IF('BİLGİ GİRİŞİ'!AJ30=\"\",\"\",'BİLGİ GİRİŞİ'!AJ30)","v":3000},null,null,{"$f":"IF('BİLGİ GİRİŞİ'!AN30=\"\",\"\",'BİLGİ GİRİŞİ'!AN30)","v":6000},null,null,{"$f":"IF('BİLGİ GİRİŞİ'!AR30=\"\",\"\",'BİLGİ GİRİŞİ'!AR30)","v":4000},null,null,{"$f":"IF('BİLGİ GİRİŞİ'!AV30=\"\",\"\",'BİLGİ GİRİŞİ'!AV30)","v":8000},null,null,{"$f":"IF(P16=\"\",\"\",(X16+AD16+AJ16)/3)","v":3000},null,null,{"$f":"IF(P16=\"\",\"\",(AA16+AG16+AM16)/3)","v":6000}]
[{"$f":"IF('BİLGİ GİRİŞİ'!D31=\"\",\"\",'BİLGİ GİRİŞİ'!D31)","v":2},{"$f":"IF('BİLGİ GİRİŞİ'!E31=\"\",\"\",'BİLGİ GİRİŞİ'!E31)","v":"Fotokopi Makinesi"},null,null,null,null,null,null,null,null,null,null,null,null,null,{"$f":"IF('BİLGİ GİRİŞİ'!W31=\"\",\"\",'BİLGİ GİRİŞİ'!W31)","v":"Adet"},null,null,null,{"$f":"IF('BİLGİ GİRİŞİ'!T31=\"\",\"\",'BİLGİ GİRİŞİ'!T31)","v":2},null,null,null,{"$f":"IF('BİLGİ GİRİŞİ'!AB31=\"\",\"\",'BİLGİ GİRİŞİ'!AB31)","v":3000},null,null,{"$f":"IF('BİLGİ GİRİŞİ'!AF31=\"\",\"\",'BİLGİ GİRİŞİ'!AF31)","v":6000},null,null,{"$f":"IF('BİLGİ GİRİŞİ'!AJ31=\"\",\"\",'BİLGİ GİRİŞİ'!AJ31)","v":4000},null,null,{"$f":"IF('BİLGİ GİRİŞİ'!AN31=\"\",\"\",'BİLGİ GİRİŞİ'!AN31)","v":8000},null,null,{"$f":"IF('BİLGİ GİRİŞİ'!AR31=\"\",\"\",'BİLGİ GİRİŞİ'!AR31)","v":5000},null,null,{"$f":"IF('BİLGİ GİRİŞİ'!AV31=\"\",\"\",'BİLGİ GİRİŞİ'!AV31)","v":10000},null,null,{"$f":"IF(P17=\"\",\"\",(X17+AD17+AJ17)/3)","v":4000},null,null,{"$f":"IF(P17=\"\",\"\",(AA17+AG17+AM17)/3)","v":8000}]
[{"$f":"IF('BİLGİ GİRİŞİ'!D32=\"\",\"\",'BİLGİ GİRİŞİ'!D32)","v":3},{"$f":"IF('BİLGİ GİRİŞİ'!E32=\"\",\"\",'BİLGİ GİRİŞİ'!E32)","v":"Projektör"},null,null,null,null,null,null,null,null,null,null,null,null,null,{"$f":"IF('BİLGİ GİRİŞİ'!W32=\"\",\"\",'BİLGİ GİRİŞİ'!W32)","v":"Adet"},null,null,null,{"$f":"IF('BİLGİ GİRİŞİ'!T32=\"\",\"\",'BİLGİ GİRİŞİ'!T32)","v":2},null,null,null,{"$f":"IF('BİLGİ GİRİŞİ'!AB32=\"\",\"\",'BİLGİ GİRİŞİ'!AB32)","v":4000},null,null,{"$f":"IF('BİLGİ GİRİŞİ'!AF32=\"\",\"\",'BİLGİ GİRİŞİ'!AF32)","v":8000},null,null,{"$f":"IF('BİLGİ GİRİŞİ'!AJ32=\"\",\"\",'BİLGİ GİRİŞİ'!AJ32)","v":5000},null,null,{"$f":"IF('BİLGİ GİRİŞİ'!AN32=\"\",\"\",'BİLGİ GİRİŞİ'!AN32)","v":10000},null,null,{"$f":"IF('BİLGİ GİRİŞİ'!AR32=\"\",\"\",'BİLGİ GİRİŞİ'!AR32)","v":6000},null,null,{"$f":"IF('BİLGİ GİRİŞİ'!AV32=\"\",\"\",'BİLGİ GİRİŞİ'!AV32)","v":12000},null,null,5000,null,null,10000]
[{"$f":"IF('BİLGİ GİRİŞİ'!D33=\"\",\"\",'BİLGİ GİRİŞİ'!D33)","v":""},{"$f":"IF('BİLGİ GİRİŞİ'!E33=\"\",\"\",'BİLGİ GİRİŞİ'!E33)","v":""},null,null,null,null,null,null,null,null,null,null,null,null,null,{"$f":"IF('BİLGİ GİRİŞİ'!W33=\"\",\"\",'BİLGİ GİRİŞİ'!W33)","v":""},null,null,null,{"$f":"IF('BİLGİ GİRİŞİ'!T33=\"\",\"\",'BİLGİ GİRİŞİ'!T33)","v":""},null,null,null,{"$f":"IF('BİLGİ GİRİŞİ'!AB33=\"\",\"\",'BİLGİ GİRİŞİ'!AB33)","v":""},null,null,{"$f":"IF('BİLGİ GİRİŞİ'!AF33=\"\",\"\",'BİLGİ GİRİŞİ'!AF33)","v":""},null,null,{"$f":"IF('BİLGİ GİRİŞİ'!AJ33=\"\",\"\",'BİLGİ GİRİŞİ'!AJ33)","v":""},null,null,{"$f":"IF('BİLGİ GİRİŞİ'!AN33=\"\",\"\",'BİLGİ GİRİŞİ'!AN33)","v":""},null,null,{"$f":"IF('BİLGİ GİRİŞİ'!AR33=\"\",\"\",'BİLGİ GİRİŞİ'!AR33)","v":""},null,null,{"$f":"IF('BİLGİ GİRİŞİ'!AV33=\"\",\"\",'BİLGİ GİRİŞİ'!AV33)","v":""},null,null,"",null,null,""]
[{"$f":"IF('BİLGİ GİRİŞİ'!D34=\"\",\"\",'BİLGİ GİRİŞİ'!D34)","v":""},{"$f":"IF('BİLGİ GİRİŞİ'!E34=\"\",\"\",'BİLGİ GİRİŞİ'!E34)","v":""},null,null,null,null,null,null,null,null,null,null,null,null,null,{"$f":"IF('BİLGİ GİRİŞİ'!W34=\"\",\"\",'BİLGİ GİRİŞİ'!W34)","v":""},null,null,null,{"$f":"IF('BİLGİ GİRİŞİ'!T34=\"\",\"\",'BİLGİ GİRİŞİ'!T34)","v":""},null,null,null,{"$f":"IF('BİLGİ GİRİŞİ'!AB34=\"\",\"\",'BİLGİ GİRİŞİ'!AB34)","v":""},null,null,{"$f":"IF('BİLGİ GİRİŞİ'!AF34=\"\",\"\",'BİLGİ GİRİŞİ'!AF34)","v":""},null,null,{"$f":"IF('BİLGİ GİRİŞİ'!AJ34=\"\",\"\",'BİLGİ GİRİŞİ'!AJ34)","v":""},null,null,{"$f":"IF('BİLGİ GİRİŞİ'!AN34=\"\",\"\",'BİLGİ GİRİŞİ'!AN34)","v":""},null,null,{"$f":"IF('BİLGİ GİRİŞİ'!AR34=\"\",\"\",'BİLGİ GİRİŞİ'!AR34)","v":""},null,null,{"$f":"IF('BİLGİ GİRİŞİ'!AV34=\"\",\"\",'BİLGİ GİRİŞİ'!AV34)","v":""},null,null,"",null,null,""]
[{"$f":"IF('BİLGİ GİRİŞİ'!D35=\"\",\"\",'BİLGİ GİRİŞİ'!D35)","v":""},{"$f":"IF('BİLGİ GİRİŞİ'!E35=\"\",\"\",'BİLGİ GİRİŞİ'!E35)","v":""},null,null,null,null,null,null,null,null,null,null,null,null,null,{"$f":"IF('BİLGİ GİRİŞİ'!W35=\"\",\"\",'BİLGİ GİRİŞİ'!W35)","v":""},null,null,null,{"$f":"IF('BİLGİ GİRİŞİ'!T35=\"\",\"\",'BİLGİ GİRİŞİ'!T35)","v":""},null,null,null,{"$f":"IF('BİLGİ GİRİŞİ'!AB35=\"\",\"\",'BİLGİ GİRİŞİ'!AB35)","v":""},null,null,{"$f":"IF('BİLGİ GİRİŞİ'!AF35=\"\",\"\",'BİLGİ GİRİŞİ'!AF35)","v":""},null,null,{"$f":"IF('BİLGİ GİRİŞİ'!AJ35=\"\",\"\",'BİLGİ GİRİŞİ'!AJ35)","v":""},null,null,{"$f":"IF('BİLGİ GİRİŞİ'!AN35=\"\",\"\",'BİLGİ GİRİŞİ'!AN35)","v":""},null,null,{"$f":"IF('BİLGİ GİRİŞİ'!AR35=\"\",\"\",'BİLGİ GİRİŞİ'!AR35)","v":""},null,null,{"$f":"IF('BİLGİ GİRİŞİ'!AV35=\"\",\"\",'BİLGİ GİRİŞİ'!AV35)","v":""},null,null,"",null,null,""]
[{"$f":"IF('BİLGİ GİRİŞİ'!D36=\"\",\"\",'BİLGİ GİRİŞİ'!D36)","v":""},{"$f":"IF('BİLGİ GİRİŞİ'!E36=\"\",\"\",'BİLGİ GİRİŞİ'!E36)","v":""},null,null,null,null,null,null,null,null,null,null,null,null,null,{"$f":"IF('BİLGİ GİRİŞİ'!W36=\"\",\"\",'BİLGİ GİRİŞİ'!W36)","v":""},null,null,null,{"$f":"IF('BİLGİ GİRİŞİ'!T36=\"\",\"\",'BİLGİ GİRİŞİ'!T36)","v":""},null,null,null,{"$f":"IF('BİLGİ GİRİŞİ'!AB36=\"\",\"\",'BİLGİ GİRİŞİ'!AB36)","v":""},null,null,{"$f":"IF('BİLGİ GİRİŞİ'!AF36=\"\",\"\",'BİLGİ GİRİŞİ'!AF36)","v":""},null,null,{"$f":"IF('BİLGİ GİRİŞİ'!AJ36=\"\",\"\",'BİLGİ GİRİŞİ'!AJ36)","v":""},null,null,{"$f":"IF('BİLGİ GİRİŞİ'!AN36=\"\",\"\",'BİLGİ GİRİŞİ'!AN36)","v":""},null,null,{"$f":"IF('BİLGİ GİRİŞİ'!AR36=\"\",\"\",'BİLGİ GİRİŞİ'!AR36)","v":""},null,null,{"$f":"IF('BİLGİ GİRİŞİ'!AV36=\"\",\"\",'BİLGİ GİRİŞİ'!AV36)","v":""},null,null,"",null,null,""]
[{"$f":"IF('BİLGİ GİRİŞİ'!D37=\"\",\"\",'BİLGİ GİRİŞİ'!D37)","v":""},{"$f":"IF('BİLGİ GİRİŞİ'!E37=\"\",\"\",'BİLGİ GİRİŞİ'!E37)","v":""},null,null,null,null,null,null,null,null,null,null,null,null,null,{"$f":"IF('BİLGİ GİRİŞİ'!W37=\"\",\"\",'BİLGİ GİRİŞİ'!W37)","v":""},null,null,null,{"$f":"IF('BİLGİ GİRİŞİ'!T37=\"\",\"\",'BİLGİ GİRİŞİ'!T37)","v":""},null,null,null,{"$f":"IF('BİLGİ GİRİŞİ'!AB37=\"\",\"\",'BİLGİ GİRİŞİ'!AB37)","v":""},null,null,{"$f":"IF('BİLGİ GİRİŞİ'!AF37=\"\",\"\",'BİLGİ GİRİŞİ'!AF37)","v":""},null,null,{"$f":"IF('BİLGİ GİRİŞİ'!AJ37=\"\",\"\",'BİLGİ GİRİŞİ'!AJ37)","v":""},null,null,{"$f":"IF('BİLGİ GİRİŞİ'!AN37=\"\",\"\",'BİLGİ GİRİŞİ'!AN37)","v":""},null,null,{"$f":"IF('BİLGİ GİRİŞİ'!AR37=\"\",\"\",'BİLGİ GİRİŞİ'!AR37)","v":""},null,null,{"$f":"IF('BİLGİ GİRİŞİ'!AV37=\"\",\"\",'BİLGİ GİRİŞİ'!AV37)","v":""},null,null,"",null,null,""]
[{"$f":"IF('BİLGİ GİRİŞİ'!D38=\"\",\"\",'BİLGİ GİRİŞİ'!D38)","v":""},{"$f":"IF('BİLGİ GİRİŞİ'!E38=\"\",\"\",'BİLGİ GİRİŞİ'!E38)","v":""},null,null,null,null,null,null,null,null,null,null,null,null,null,{"$f":"IF('BİLGİ GİRİŞİ'!W38=\"\",\"\",'BİLGİ GİRİŞİ'!W38)","v":""},null,null,null,{"$f":"IF('BİLGİ GİRİŞİ'!T38=\"\",\"\",'BİLGİ GİRİŞİ'!T38)","v":""},null,null,null,{"$f":"IF('BİLGİ GİRİŞİ'!AB38=\"\",\"\",'BİLGİ GİRİŞİ'!AB38)","v":""},null,null,{"$f":"IF('BİLGİ GİRİŞİ'!AF38=\"\",\"\",'BİLGİ GİRİŞİ'!AF38)","v":""},null,null,{"$f":"IF('BİLGİ GİRİŞİ'!AJ38=\"\",\"\",'BİLGİ GİRİŞİ'!AJ38)","v":""},null,null,{"$f":"IF('BİLGİ GİRİŞİ'!AN38=\"\",\"\",'BİLGİ GİRİŞİ'!AN38)","v":""},null,null,{"$f":"IF('BİLGİ GİRİŞİ'!AR38=\"\",\"\",'BİLGİ GİRİŞİ'!AR38)","v":""},null,null,{"$f":"IF('BİLGİ GİRİŞİ'!AV38=\"\",\"\",'BİLGİ GİRİŞİ'!AV38)","v":""},null,null,"",null,null,""]
[{"$f":"IF('BİLGİ GİRİŞİ'!D39=\"\",\"\",'BİLGİ GİRİŞİ'!D39)","v":""},{"$f":"IF('BİLGİ GİRİŞİ'!E39=\"\",\"\",'BİLGİ GİRİŞİ'!E39)","v":""},null,null,null,null,null,null,null,null,null,null,null,null,null,{"$f":"IF('BİLGİ GİRİŞİ'!W39=\"\",\"\",'BİLGİ GİRİŞİ'!W39)","v":""},null,null,null,{"$f":"IF('BİLGİ GİRİŞİ'!T39=\"\",\"\",'BİLGİ GİRİŞİ'!T39)","v":""},null,null,null,{"$f":"IF('BİLGİ GİRİŞİ'!AB39=\"\",\"\",'BİLGİ GİRİŞİ'!AB39)","v":""},null,null,{"$f":"IF('BİLGİ GİRİŞİ'!AF39=\"\",\"\",'BİLGİ GİRİŞİ'!AF39)","v":""},null,null,{"$f":"IF('BİLGİ GİRİŞİ'!AJ39=\"\",\"\",'BİLGİ GİRİŞİ'!AJ39)","v":""},null,null,{"$f":"IF('BİLGİ GİRİŞİ'!AN39=\"\",\"\",'BİLGİ GİRİŞİ'!AN39)","v":""},null,null,{"$f":"IF('BİLGİ GİRİŞİ'!AR39=\"\",\"\",'BİLGİ GİRİŞİ'!AR39)","v":""},null,null,{"$f":"IF('BİLGİ GİRİŞİ'!AV39=\"\",\"\",'BİLGİ GİRİŞİ'!AV39)","v":""},null,null,"",null,null,""]
[{"$f":"IF('BİLGİ GİRİŞİ'!D40=\"\",\"\",'BİLGİ GİRİŞİ'!D40)","v":""},{"$f":"IF('BİLGİ GİRİŞİ'!E40=\"\",\"\",'BİLGİ GİRİŞİ'!E40)","v":""},null,null,null,null,null,null,null,null,null,null,null,null,null,{"$f":"IF('BİLGİ GİRİŞİ'!W40=\"\",\"\",'BİLGİ GİRİŞİ'!W40)","v":""},null,null,null,{"$f":"IF('BİLGİ GİRİŞİ'!T40=\"\",\"\",'BİLGİ GİRİŞİ'!T40)","v":""},null,null,null,{"$f":"IF('BİLGİ GİRİŞİ'!AB40=\"\",\"\",'BİLGİ GİRİŞİ'!AB40)","v":""},null,null,{"$f":"IF('BİLGİ GİRİŞİ'!AF40=\"\",\"\",'BİLGİ GİRİŞİ'!AF40)","v":""},null,null,{"$f":"IF('BİLGİ GİRİŞİ'!AJ40=\"\",\"\",'BİLGİ GİRİŞİ'!AJ40)","v":""},null,null,{"$f":"IF('BİLGİ GİRİŞİ'!AN40=\"\",\"\",'BİLGİ GİRİŞİ'!AN40)","v":""},null,null,{"$f":"IF('BİLGİ GİRİŞİ'!AR40=\"\",\"\",'BİLGİ GİRİŞİ'!AR40)","v":""},null,null,{"$f":"IF('BİLGİ GİRİŞİ'!AV40=\"\",\"\",'BİLGİ GİRİŞİ'!AV40)","v":""},null,null,"",null,null,""]
[{"$f":"IF('BİLGİ GİRİŞİ'!D41=\"\",\"\",'BİLGİ GİRİŞİ'!D41)","v":""},{"$f":"IF('BİLGİ GİRİŞİ'!E41=\"\",\"\",'BİLGİ GİRİŞİ'!E41)","v":""},null,null,null,null,null,null,null,null,null,null,null,null,null,{"$f":"IF('BİLGİ GİRİŞİ'!W41=\"\",\"\",'BİLGİ GİRİŞİ'!W41)","v":""},null,null,null,{"$f":"IF('BİLGİ GİRİŞİ'!T41=\"\",\"\",'BİLGİ GİRİŞİ'!T41)","v":""},null,null,null,{"$f":"IF('BİLGİ GİRİŞİ'!AB41=\"\",\"\",'BİLGİ GİRİŞİ'!AB41)","v":""},null,null,{"$f":"IF('BİLGİ GİRİŞİ'!AF41=\"\",\"\",'BİLGİ GİRİŞİ'!AF41)","v":""},null,null,{"$f":"IF('BİLGİ GİRİŞİ'!AJ41=\"\",\"\",'BİLGİ GİRİŞİ'!AJ41)","v":""},null,null,{"$f":"IF('BİLGİ GİRİŞİ'!AN41=\"\",\"\",'BİLGİ GİRİŞİ'!AN41)","v":""},null,null,{"$f":"IF('BİLGİ GİRİŞİ'!AR41=\"\",\"\",'BİLGİ GİRİŞİ'!AR41)","v":""},null,null,{"$f":"IF('BİLGİ GİRİŞİ'!AV41=\"\",\"\",'BİLGİ GİRİŞİ'!AV41)","v":""},null,null,"",null,null,""]
[{"$f":"IF('BİLGİ GİRİŞİ'!D42=\"\",\"\",'BİLGİ GİRİŞİ'!D42)","v":""},{"$f":"IF('BİLGİ GİRİŞİ'!E42=\"\",\"\",'BİLGİ GİRİŞİ'!E42)","v":""},null,null,null,null,null,null,null,null,null,null,null,null,null,{"$f":"IF('BİLGİ GİRİŞİ'!W42=\"\",\"\",'BİLGİ GİRİŞİ'!W42)","v":""},null,null,null,{"$f":"IF('BİLGİ GİRİŞİ'!T42=\"\",\"\",'BİLGİ GİRİŞİ'!T42)","v":""},null,null,null,{"$f":"IF('BİLGİ GİRİŞİ'!AB42=\"\",\"\",'BİLGİ GİRİŞİ'!AB42)","v":""},null,null,{"$f":"IF('BİLGİ GİRİŞİ'!AF42=\"\",\"\",'BİLGİ GİRİŞİ'!AF42)","v":""},null,null,{"$f":"IF('BİLGİ GİRİŞİ'!AJ42=\"\",\"\",'BİLGİ GİRİŞİ'!AJ42)","v":""},null,null,{"$f":"IF('BİLGİ GİRİŞİ'!AN42=\"\",\"\",'BİLGİ GİRİŞİ'!AN42)","v":""},null,null,{"$f":"IF('BİLGİ GİRİŞİ'!AR42=\"\",\"\",'BİLGİ GİRİŞİ'!AR42)","v":""},null,null,{"$f":"IF('BİLGİ GİRİŞİ'!AV42=\"\",\"\",'BİLGİ GİRİŞİ'!AV42)","v":""},null,null,"",null,null,""]
[{"$f":"IF('BİLGİ GİRİŞİ'!D43=\"\",\"\",'BİLGİ GİRİŞİ'!D43)","v":""},{"$f":"IF('BİLGİ GİRİŞİ'!E43=\"\",\"\",'BİLGİ GİRİŞİ'!E43)","v":""},null,null,null,null,null,null,null,null,null,null,null,null,null,{"$f":"IF('BİLGİ GİRİŞİ'!W43=\"\",\"\",'BİLGİ GİRİŞİ'!W43)","v":""},null,null,null,{"$f":"IF('BİLGİ GİRİŞİ'!T43=\"\",\"\",'BİLGİ GİRİŞİ'!T43)","v":""},null,null,null,{"$f":"IF('BİLGİ GİRİŞİ'!AB43=\"\",\"\",'BİLGİ GİRİŞİ'!AB43)","v":""},null,null,{"$f":"IF('BİLGİ GİRİŞİ'!AF43=\"\",\"\",'BİLGİ GİRİŞİ'!AF43)","v":""},null,null,{"$f":"IF('BİLGİ GİRİŞİ'!AJ43=\"\",\"\",'BİLGİ GİRİŞİ'!AJ43)","v":""},null,null,{"$f":"IF('BİLGİ GİRİŞİ'!AN43=\"\",\"\",'BİLGİ GİRİŞİ'!AN43)","v":""},null,null,{"$f":"IF('BİLGİ GİRİŞİ'!AR43=\"\",\"\",'BİLGİ GİRİŞİ'!AR43)","v":""},null,null,{"$f":"IF('BİLGİ GİRİŞİ'!AV43=\"\",\"\",'BİLGİ GİRİŞİ'!AV43)","v":""},null,null,"",null,null,""]
[{"$f":"IF('BİLGİ GİRİŞİ'!D44=\"\",\"\",'BİLGİ GİRİŞİ'!D44)","v":""},{"$f":"IF('BİLGİ GİRİŞİ'!E44=\"\",\"\",'BİLGİ GİRİŞİ'!E44)","v":""},null,null,null,null,null,null,null,null,null,null,null,null,null,{"$f":"IF('BİLGİ GİRİŞİ'!W44=\"\",\"\",'BİLGİ GİRİŞİ'!W44)","v":""},null,null,null,{"$f":"IF('BİLGİ GİRİŞİ'!T44=\"\",\"\",'BİLGİ GİRİŞİ'!T44)","v":""},null,null,null,{"$f":"IF('BİLGİ GİRİŞİ'!AB44=\"\",\"\",'BİLGİ GİRİŞİ'!AB44)","v":""},null,null,{"$f":"IF('BİLGİ GİRİŞİ'!AF44=\"\",\"\",'BİLGİ GİRİŞİ'!AF44)","v":""},null,null,{"$f":"IF('BİLGİ GİRİŞİ'!AJ44=\"\",\"\",'BİLGİ GİRİŞİ'!AJ44)","v":""},null,null,{"$f":"IF('BİLGİ GİRİŞİ'!AN44=\"\",\"\",'BİLGİ GİRİŞİ'!AN44)","v":""},null,null,{"$f":"IF('BİLGİ GİRİŞİ'!AR44=\"\",\"\",'BİLGİ GİRİŞİ'!AR44)","v":""},null,null,{"$f":"IF('BİLGİ GİRİŞİ'!AV44=\"\",\"\",'BİLGİ GİRİŞİ'!AV44)","v":""},null,null,"",null,null,""]
[{"$f":"IF('BİLGİ GİRİŞİ'!D45=\"\",\"\",'BİLGİ GİRİŞİ'!D45)","v":""},{"$f":"IF('BİLGİ GİRİŞİ'!E45=\"\",\"\",'BİLGİ GİRİŞİ'!E45)","v":""},null,null,null,null,null,null,null,null,null,null,null,null,null,{"$f":"IF('BİLGİ GİRİŞİ'!W45=\"\",\"\",'BİLGİ GİRİŞİ'!W45)","v":""},null,null,null,{"$f":"IF('BİLGİ GİRİŞİ'!T45=\"\",\"\",'BİLGİ GİRİŞİ'!T45)","v":""},null,null,null,{"$f":"IF('BİLGİ GİRİŞİ'!AB45=\"\",\"\",'BİLGİ GİRİŞİ'!AB45)","v":""},null,null,{"$f":"IF('BİLGİ GİRİŞİ'!AF45=\"\",\"\",'BİLGİ GİRİŞİ'!AF45)","v":""},null,null,{"$f":"IF('BİLGİ GİRİŞİ'!AJ45=\"\",\"\",'BİLGİ GİRİŞİ'!AJ45)","v":""},null,null,{"$f":"IF('BİLGİ GİRİŞİ'!AN45=\"\",\"\",'BİLGİ GİRİŞİ'!AN45)","v":""},null,null,{"$f":"IF('BİLGİ GİRİŞİ'!AR45=\"\",\"\",'BİLGİ GİRİŞİ'!AR45)","v":""},null,null,{"$f":"IF('BİLGİ GİRİŞİ'!AV45=\"\",\"\",'BİLGİ GİRİŞİ'!AV45)","v":""},null,null,"",null,null,""]
[{"$f":"IF('BİLGİ GİRİŞİ'!D46=\"\",\"\",'BİLGİ GİRİŞİ'!D46)","v":""},{"$f":"IF('BİLGİ GİRİŞİ'!E46=\"\",\"\",'BİLGİ GİRİŞİ'!E46)","v":""},null,null,null,null,null,null,null,null,null,null,null,null,null,{"$f":"IF('BİLGİ GİRİŞİ'!W46=\"\",\"\",'BİLGİ GİRİŞİ'!W46)","v":""},null,null,null,{"$f":"IF('BİLGİ GİRİŞİ'!T46=\"\",\"\",'BİLGİ GİRİŞİ'!T46)","v":""},null,null,null,{"$f":"IF('BİLGİ GİRİŞİ'!AB46=\"\",\"\",'BİLGİ GİRİŞİ'!AB46)","v":""},null,null,{"$f":"IF('BİLGİ GİRİŞİ'!AF46=\"\",\"\",'BİLGİ GİRİŞİ'!AF46)","v":""},null,null,{"$f":"IF('BİLGİ GİRİŞİ'!AJ46=\"\",\"\",'BİLGİ GİRİŞİ'!AJ46)","v":""},null,null,{"$f":"IF('BİLGİ GİRİŞİ'!AN46=\"\",\"\",'BİLGİ GİRİŞİ'!AN46)","v":""},null,null,{"$f":"IF('BİLGİ GİRİŞİ'!AR46=\"\",\"\",'BİLGİ GİRİŞİ'!AR46)","v":""},null,null,{"$f":"IF('BİLGİ GİRİŞİ'!AV46=\"\",\"\",'BİLGİ GİRİŞİ'!AV46)","v":""},null,null,"",null,null,""]
[{"$f":"IF('BİLGİ GİRİŞİ'!D47=\"\",\"\",'BİLGİ GİRİŞİ'!D47)","v":""},{"$f":"IF('BİLGİ GİRİŞİ'!E47=\"\",\"\",'BİLGİ GİRİŞİ'!E47)","v":""},null,null,null,null,null,null,null,null,null,null,null,null,null,{"$f":"IF('BİLGİ GİRİŞİ'!W47=\"\",\"\",'BİLGİ GİRİŞİ'!W47)","v":""},null,null,null,{"$f":"IF('BİLGİ GİRİŞİ'!T47=\"\",\"\",'BİLGİ GİRİŞİ'!T47)","v":""},null,null,null,{"$f":"IF('BİLGİ GİRİŞİ'!AB47=\"\",\"\",'BİLGİ GİRİŞİ'!AB47)","v":""},null,null,{"$f":"IF('BİLGİ GİRİŞİ'!AF47=\"\",\"\",'BİLGİ GİRİŞİ'!AF47)","v":""},null,null,{"$f":"IF('BİLGİ GİRİŞİ'!AJ47=\"\",\"\",'BİLGİ GİRİŞİ'!AJ47)","v":""},null,null,{"$f":"IF('BİLGİ GİRİŞİ'!AN47=\"\",\"\",'BİLGİ GİRİŞİ'!AN47)","v":""},null,null,{"$f":"IF('BİLGİ GİRİŞİ'!AR47=\"\",\"\",'BİLGİ GİRİŞİ'!AR47)","v":""},null,null,{"$f":"IF('BİLGİ GİRİŞİ'!AV47=\"\",\"\",'BİLGİ GİRİŞİ'!AV47)","v":""},null,null,"",null,null,""]
[{"$f":"IF('BİLGİ GİRİŞİ'!D48=\"\",\"\",'BİLGİ GİRİŞİ'!D48)","v":""},{"$f":"IF('BİLGİ GİRİŞİ'!E48=\"\",\"\",'BİLGİ GİRİŞİ'!E48)","v":""},null,null,null,null,null,null,null,null,null,null,null,null,null,{"$f":"IF('BİLGİ GİRİŞİ'!W48=\"\",\"\",'BİLGİ GİRİŞİ'!W48)","v":""},null,null,null,{"$f":"IF('BİLGİ GİRİŞİ'!T48=\"\",\"\",'BİLGİ GİRİŞİ'!T48)","v":""},null,null,null,{"$f":"IF('BİLGİ GİRİŞİ'!AB48=\"\",\"\",'BİLGİ GİRİŞİ'!AB48)","v":""},null,null,{"$f":"IF('BİLGİ GİRİŞİ'!AF48=\"\",\"\",'BİLGİ GİRİŞİ'!AF48)","v":""},null,null,{"$f":"IF('BİLGİ GİRİŞİ'!AJ48=\"\",\"\",'BİLGİ GİRİŞİ'!AJ48)","v":""},null,null,{"$f":"IF('BİLGİ GİRİŞİ'!AN48=\"\",\"\",'BİLGİ GİRİŞİ'!AN48)","v":""},null,null,{"$f":"IF('BİLGİ GİRİŞİ'!AR48=\"\",\"\",'BİLGİ GİRİŞİ'!AR48)","v":""},null,null,{"$f":"IF('BİLGİ GİRİŞİ'!AV48=\"\",\"\",'BİLGİ GİRİŞİ'!AV48)","v":""},null,null,{"$f":"IF(P34=\"\",\"\",(X34+AD34+AJ34)/3)","v":""},null,null,{"$f":"IF(P34=\"\",\"\",(AA34+AG34+AM34)/3)","v":""}]
[{"$f":"IF('BİLGİ GİRİŞİ'!D49=\"\",\"\",'BİLGİ GİRİŞİ'!D49)","v":""},{"$f":"IF('BİLGİ GİRİŞİ'!E49=\"\",\"\",'BİLGİ GİRİŞİ'!E49)","v":""},null,null,null,null,null,null,null,null,null,null,null,null,null,{"$f":"IF('BİLGİ GİRİŞİ'!W49=\"\",\"\",'BİLGİ GİRİŞİ'!W49)","v":""},null,null,null,{"$f":"IF('BİLGİ GİRİŞİ'!T49=\"\",\"\",'BİLGİ GİRİŞİ'!T49)","v":""},null,null,null,{"$f":"IF('BİLGİ GİRİŞİ'!AB49=\"\",\"\",'BİLGİ GİRİŞİ'!AB49)","v":""},null,null,{"$f":"IF('BİLGİ GİRİŞİ'!AF49=\"\",\"\",'BİLGİ GİRİŞİ'!AF49)","v":""},null,null,{"$f":"IF('BİLGİ GİRİŞİ'!AJ49=\"\",\"\",'BİLGİ GİRİŞİ'!AJ49)","v":""},null,null,{"$f":"IF('BİLGİ GİRİŞİ'!AN49=\"\",\"\",'BİLGİ GİRİŞİ'!AN49)","v":""},null,null,{"$f":"IF('BİLGİ GİRİŞİ'!AR49=\"\",\"\",'BİLGİ GİRİŞİ'!AR49)","v":""},null,null,{"$f":"IF('BİLGİ GİRİŞİ'!AV49=\"\",\"\",'BİLGİ GİRİŞİ'!AV49)","v":""},null,null,"",null,null,""]
[{"$f":"IF('BİLGİ GİRİŞİ'!D50=\"\",\"\",'BİLGİ GİRİŞİ'!D50)","v":""},{"$f":"IF('BİLGİ GİRİŞİ'!E50=\"\",\"\",'BİLGİ GİRİŞİ'!E50)","v":""},null,null,null,null,null,null,null,null,null,null,null,null,null,{"$f":"IF('BİLGİ GİRİŞİ'!W50=\"\",\"\",'BİLGİ GİRİŞİ'!W50)","v":""},null,null,null,{"$f":"IF('BİLGİ GİRİŞİ'!T50=\"\",\"\",'BİLGİ GİRİŞİ'!T50)","v":""},null,null,null,{"$f":"IF('BİLGİ GİRİŞİ'!AB50=\"\",\"\",'BİLGİ GİRİŞİ'!AB50)","v":""},null,null,{"$f":"IF('BİLGİ GİRİŞİ'!AF50=\"\",\"\",'BİLGİ GİRİŞİ'!AF50)","v":""},null,null,{"$f":"IF('BİLGİ GİRİŞİ'!AJ50=\"\",\"\",'BİLGİ GİRİŞİ'!AJ50)","v":""},null,null,{"$f":"IF('BİLGİ GİRİŞİ'!AN50=\"\",\"\",'BİLGİ GİRİŞİ'!AN50)","v":""},null,null,{"$f":"IF('BİLGİ GİRİŞİ'!AR50=\"\",\"\",'BİLGİ GİRİŞİ'!AR50)","v":""},null,null,{"$f":"IF('BİLGİ GİRİŞİ'!AV50=\"\",\"\",'BİLGİ GİRİŞİ'!AV50)","v":""},null,null,"",null,null,""]
[{"$f":"IF('BİLGİ GİRİŞİ'!D51=\"\",\"\",'BİLGİ GİRİŞİ'!D51)","v":""},{"$f":"IF('BİLGİ GİRİŞİ'!E51=\"\",\"\",'BİLGİ GİRİŞİ'!E51)","v":""},null,null,null,null,null,null,null,null,null,null,null,null,null,{"$f":"IF('BİLGİ GİRİŞİ'!W51=\"\",\"\",'BİLGİ GİRİŞİ'!W51)","v":""},null,null,null,{"$f":"IF('BİLGİ GİRİŞİ'!T51=\"\",\"\",'BİLGİ GİRİŞİ'!T51)","v":""},null,null,null,{"$f":"IF('BİLGİ GİRİŞİ'!AB51=\"\",\"\",'BİLGİ GİRİŞİ'!AB51)","v":""},null,null,{"$f":"IF('BİLGİ GİRİŞİ'!AF51=\"\",\"\",'BİLGİ GİRİŞİ'!AF51)","v":""},null,null,{"$f":"IF('BİLGİ GİRİŞİ'!AJ51=\"\",\"\",'BİLGİ GİRİŞİ'!AJ51)","v":""},null,null,{"$f":"IF('BİLGİ GİRİŞİ'!AN51=\"\",\"\",'BİLGİ GİRİŞİ'!AN51)","v":""},null,null,{"$f":"IF('BİLGİ GİRİŞİ'!AR51=\"\",\"\",'BİLGİ GİRİŞİ'!AR51)","v":""},null,null,{"$f":"IF('BİLGİ GİRİŞİ'!AV51=\"\",\"\",'BİLGİ GİRİŞİ'!AV51)","v":""},null,null,"",null,null,""]
[{"$f":"IF('BİLGİ GİRİŞİ'!D52=\"\",\"\",'BİLGİ GİRİŞİ'!D52)","v":""},{"$f":"IF('BİLGİ GİRİŞİ'!E52=\"\",\"\",'BİLGİ GİRİŞİ'!E52)","v":""},null,null,null,null,null,null,null,null,null,null,null,null,null,{"$f":"IF('BİLGİ GİRİŞİ'!W52=\"\",\"\",'BİLGİ GİRİŞİ'!W52)","v":""},null,null,null,{"$f":"IF('BİLGİ GİRİŞİ'!T52=\"\",\"\",'BİLGİ GİRİŞİ'!T52)","v":""},null,null,null,{"$f":"IF('BİLGİ GİRİŞİ'!AB52=\"\",\"\",'BİLGİ GİRİŞİ'!AB52)","v":""},null,null,{"$f":"IF('BİLGİ GİRİŞİ'!AF52=\"\",\"\",'BİLGİ GİRİŞİ'!AF52)","v":""},null,null,{"$f":"IF('BİLGİ GİRİŞİ'!AJ52=\"\",\"\",'BİLGİ GİRİŞİ'!AJ52)","v":""},null,null,{"$f":"IF('BİLGİ GİRİŞİ'!AN52=\"\",\"\",'BİLGİ GİRİŞİ'!AN52)","v":""},null,null,{"$f":"IF('BİLGİ GİRİŞİ'!AR52=\"\",\"\",'BİLGİ GİRİŞİ'!AR52)","v":""},null,null,{"$f":"IF('BİLGİ GİRİŞİ'!AV52=\"\",\"\",'BİLGİ GİRİŞİ'!AV52)","v":""},null,null,"",null,null,""]
[{"$f":"IF('BİLGİ GİRİŞİ'!D53=\"\",\"\",'BİLGİ GİRİŞİ'!D53)","v":""},{"$f":"IF('BİLGİ GİRİŞİ'!E53=\"\",\"\",'BİLGİ GİRİŞİ'!E53)","v":""},null,null,null,null,null,null,null,null,null,null,null,null,null,{"$f":"IF('BİLGİ GİRİŞİ'!W53=\"\",\"\",'BİLGİ GİRİŞİ'!W53)","v":""},null,null,null,{"$f":"IF('BİLGİ GİRİŞİ'!T53=\"\",\"\",'BİLGİ GİRİŞİ'!T53)","v":""},null,null,null,{"$f":"IF('BİLGİ GİRİŞİ'!AB53=\"\",\"\",'BİLGİ GİRİŞİ'!AB53)","v":""},null,null,{"$f":"IF('BİLGİ GİRİŞİ'!AF53=\"\",\"\",'BİLGİ GİRİŞİ'!AF53)","v":""},null,null,{"$f":"IF('BİLGİ GİRİŞİ'!AJ53=\"\",\"\",'BİLGİ GİRİŞİ'!AJ53)","v":""},null,null,{"$f":"IF('BİLGİ GİRİŞİ'!AN53=\"\",\"\",'BİLGİ GİRİŞİ'!AN53)","v":""},null,null,{"$f":"IF('BİLGİ GİRİŞİ'!AR53=\"\",\"\",'BİLGİ GİRİŞİ'!AR53)","v":""},null,null,{"$f":"IF('BİLGİ GİRİŞİ'!AV53=\"\",\"\",'BİLGİ GİRİŞİ'!AV53)","v":""},null,null,"",null,null,""]
[{"$f":"IF('BİLGİ GİRİŞİ'!D54=\"\",\"\",'BİLGİ GİRİŞİ'!D54)","v":""},{"$f":"IF('BİLGİ GİRİŞİ'!E54=\"\",\"\",'BİLGİ GİRİŞİ'!E54)","v":""},null,null,null,null,null,null,null,null,null,null,null,null,null,{"$f":"IF('BİLGİ GİRİŞİ'!W54=\"\",\"\",'BİLGİ GİRİŞİ'!W54)","v":""},null,null,null,{"$f":"IF('BİLGİ GİRİŞİ'!T54=\"\",\"\",'BİLGİ GİRİŞİ'!T54)","v":""},null,null,null,{"$f":"IF('BİLGİ GİRİŞİ'!AB54=\"\",\"\",'BİLGİ GİRİŞİ'!AB54)","v":""},null,null,{"$f":"IF('BİLGİ GİRİŞİ'!AF54=\"\",\"\",'BİLGİ GİRİŞİ'!AF54)","v":""},null,null,{"$f":"IF('BİLGİ GİRİŞİ'!AJ54=\"\",\"\",'BİLGİ GİRİŞİ'!AJ54)","v":""},null,null,{"$f":"IF('BİLGİ GİRİŞİ'!AN54=\"\",\"\",'BİLGİ GİRİŞİ'!AN54)","v":""},null,null,{"$f":"IF('BİLGİ GİRİŞİ'!AR54=\"\",\"\",'BİLGİ GİRİŞİ'!AR54)","v":""},null,null,{"$f":"IF('BİLGİ GİRİŞİ'!AV54=\"\",\"\",'BİLGİ GİRİŞİ'!AV54)","v":""},null,null,"",null,null,""]
[{"$f":"IF('BİLGİ GİRİŞİ'!D55=\"\",\"\",'BİLGİ GİRİŞİ'!D55)","v":""},{"$f":"IF('BİLGİ GİRİŞİ'!E55=\"\",\"\",'BİLGİ GİRİŞİ'!E55)","v":""},null,null,null,null,null,null,null,null,null,null,null,null,null,{"$f":"IF('BİLGİ GİRİŞİ'!W55=\"\",\"\",'BİLGİ GİRİŞİ'!W55)","v":""},null,null,null,{"$f":"IF('BİLGİ GİRİŞİ'!T55=\"\",\"\",'BİLGİ GİRİŞİ'!T55)","v":""},null,null,null,{"$f":"IF('BİLGİ GİRİŞİ'!AB55=\"\",\"\",'BİLGİ GİRİŞİ'!AB55)","v":""},null,null,{"$f":"IF('BİLGİ GİRİŞİ'!AF55=\"\",\"\",'BİLGİ GİRİŞİ'!AF55)","v":""},null,null,{"$f":"IF('BİLGİ GİRİŞİ'!AJ55=\"\",\"\",'BİLGİ GİRİŞİ'!AJ55)","v":""},null,null,{"$f":"IF('BİLGİ GİRİŞİ'!AN55=\"\",\"\",'BİLGİ GİRİŞİ'!AN55)","v":""},null,null,{"$f":"IF('BİLGİ GİRİŞİ'!AR55=\"\",\"\",'BİLGİ GİRİŞİ'!AR55)","v":""},null,null,{"$f":"IF('BİLGİ GİRİŞİ'!AV55=\"\",\"\",'BİLGİ GİRİŞİ'!AV55)","v":""},null,null,"",null,null,""]
[{"$f":"IF('BİLGİ GİRİŞİ'!D56=\"\",\"\",'BİLGİ GİRİŞİ'!D56)","v":""},{"$f":"IF('BİLGİ GİRİŞİ'!E56=\"\",\"\",'BİLGİ GİRİŞİ'!E56)","v":""},null,null,null,null,null,null,null,null,null,null,null,null,null,{"$f":"IF('BİLGİ GİRİŞİ'!W56=\"\",\"\",'BİLGİ GİRİŞİ'!W56)","v":""},null,null,null,{"$f":"IF('BİLGİ GİRİŞİ'!T56=\"\",\"\",'BİLGİ GİRİŞİ'!T56)","v":""},null,null,null,{"$f":"IF('BİLGİ GİRİŞİ'!AB56=\"\",\"\",'BİLGİ GİRİŞİ'!AB56)","v":""},null,null,{"$f":"IF('BİLGİ GİRİŞİ'!AF56=\"\",\"\",'BİLGİ GİRİŞİ'!AF56)","v":""},null,null,{"$f":"IF('BİLGİ GİRİŞİ'!AJ56=\"\",\"\",'BİLGİ GİRİŞİ'!AJ56)","v":""},null,null,{"$f":"IF('BİLGİ GİRİŞİ'!AN56=\"\",\"\",'BİLGİ GİRİŞİ'!AN56)","v":""},null,null,{"$f":"IF('BİLGİ GİRİŞİ'!AR56=\"\",\"\",'BİLGİ GİRİŞİ'!AR56)","v":""},null,null,{"$f":"IF('BİLGİ GİRİŞİ'!AV56=\"\",\"\",'BİLGİ GİRİŞİ'!AV56)","v":""},null,null,"",null,null,""]
[{"$f":"IF('BİLGİ GİRİŞİ'!D57=\"\",\"\",'BİLGİ GİRİŞİ'!D57)","v":""},{"$f":"IF('BİLGİ GİRİŞİ'!E57=\"\",\"\",'BİLGİ GİRİŞİ'!E57)","v":""},null,null,null,null,null,null,null,null,null,null,null,null,null,{"$f":"IF('BİLGİ GİRİŞİ'!W57=\"\",\"\",'BİLGİ GİRİŞİ'!W57)","v":""},null,null,null,{"$f":"IF('BİLGİ GİRİŞİ'!T57=\"\",\"\",'BİLGİ GİRİŞİ'!T57)","v":""},null,null,null,{"$f":"IF('BİLGİ GİRİŞİ'!AB57=\"\",\"\",'BİLGİ GİRİŞİ'!AB57)","v":""},null,null,{"$f":"IF('BİLGİ GİRİŞİ'!AF57=\"\",\"\",'BİLGİ GİRİŞİ'!AF57)","v":""},null,null,{"$f":"IF('BİLGİ GİRİŞİ'!AJ57=\"\",\"\",'BİLGİ GİRİŞİ'!AJ57)","v":""},null,null,{"$f":"IF('BİLGİ GİRİŞİ'!AN57=\"\",\"\",'BİLGİ GİRİŞİ'!AN57)","v":""},null,null,{"$f":"IF('BİLGİ GİRİŞİ'!AR57=\"\",\"\",'BİLGİ GİRİŞİ'!AR57)","v":""},null,null,{"$f":"IF('BİLGİ GİRİŞİ'!AV57=\"\",\"\",'BİLGİ GİRİŞİ'!AV57)","v":""},null,null,"",null,null,""]
[{"$f":"IF('BİLGİ GİRİŞİ'!D58=\"\",\"\",'BİLGİ GİRİŞİ'!D58)","v":""},{"$f":"IF('BİLGİ GİRİŞİ'!E58=\"\",\"\",'BİLGİ GİRİŞİ'!E58)","v":""},null,null,null,null,null,null,null,null,null,null,null,null,null,{"$f":"IF('BİLGİ GİRİŞİ'!W58=\"\",\"\",'BİLGİ GİRİŞİ'!W58)","v":""},null,null,null,{"$f":"IF('BİLGİ GİRİŞİ'!T58=\"\",\"\",'BİLGİ GİRİŞİ'!T58)","v":""},null,null,null,{"$f":"IF('BİLGİ GİRİŞİ'!AB58=\"\",\"\",'BİLGİ GİRİŞİ'!AB58)","v":""},null,null,{"$f":"IF('BİLGİ GİRİŞİ'!AF58=\"\",\"\",'BİLGİ GİRİŞİ'!AF58)","v":""},null,null,{"$f":"IF('BİLGİ GİRİŞİ'!AJ58=\"\",\"\",'BİLGİ GİRİŞİ'!AJ58)","v":""},null,null,{"$f":"IF('BİLGİ GİRİŞİ'!AN58=\"\",\"\",'BİLGİ GİRİŞİ'!AN58)","v":""},null,null,{"$f":"IF('BİLGİ GİRİŞİ'!AR58=\"\",\"\",'BİLGİ GİRİŞİ'!AR58)","v":""},null,null,{"$f":"IF('BİLGİ GİRİŞİ'!AV58=\"\",\"\",'BİLGİ GİRİŞİ'!AV58)","v":""},null,null,"",null,null,""]
[{"$f":"IF('BİLGİ GİRİŞİ'!D59=\"\",\"\",'BİLGİ GİRİŞİ'!D59)","v":""},{"$f":"IF('BİLGİ GİRİŞİ'!E59=\"\",\"\",'BİLGİ GİRİŞİ'!E59)","v":""},null,null,null,null,null,null,null,null,null,null,null,null,null,{"$f":"IF('BİLGİ GİRİŞİ'!W59=\"\",\"\",'BİLGİ GİRİŞİ'!W59)","v":""},null,null,null,{"$f":"IF('BİLGİ GİRİŞİ'!T59=\"\",\"\",'BİLGİ GİRİŞİ'!T59)","v":""},null,null,null,{"$f":"IF('BİLGİ GİRİŞİ'!AB59=\"\",\"\",'BİLGİ GİRİŞİ'!AB59)","v":""},null,null,{"$f":"IF('BİLGİ GİRİŞİ'!AF59=\"\",\"\",'BİLGİ GİRİŞİ'!AF59)","v":""},null,null,{"$f":"IF('BİLGİ GİRİŞİ'!AJ59=\"\",\"\",'BİLGİ GİRİŞİ'!AJ59)","v":""},null,null,{"$f":"IF('BİLGİ GİRİŞİ'!AN59=\"\",\"\",'BİLGİ GİRİŞİ'!AN59)","v":""},null,null,{"$f":"IF('BİLGİ GİRİŞİ'!AR59=\"\",\"\",'BİLGİ GİRİŞİ'!AR59)","v":""},null,null,{"$f":"IF('BİLGİ GİRİŞİ'!AV59=\"\",\"\",'BİLGİ GİRİŞİ'!AV59)","v":""},null,null,"",null,null,""]
[{"$f":"IF('BİLGİ GİRİŞİ'!D60=\"\",\"\",'BİLGİ GİRİŞİ'!D60)","v":""},{"$f":"IF('BİLGİ GİRİŞİ'!E60=\"\",\"\",'BİLGİ GİRİŞİ'!E60)","v":""},null,null,null,null,null,null,null,null,null,null,null,null,null,{"$f":"IF('BİLGİ GİRİŞİ'!W60=\"\",\"\",'BİLGİ GİRİŞİ'!W60)","v":""},null,null,null,{"$f":"IF('BİLGİ GİRİŞİ'!T60=\"\",\"\",'BİLGİ GİRİŞİ'!T60)","v":""},null,null,null,{"$f":"IF('BİLGİ GİRİŞİ'!AB60=\"\",\"\",'BİLGİ GİRİŞİ'!AB60)","v":""},null,null,{"$f":"IF('BİLGİ GİRİŞİ'!AF60=\"\",\"\",'BİLGİ GİRİŞİ'!AF60)","v":""},null,null,{"$f":"IF('BİLGİ GİRİŞİ'!AJ60=\"\",\"\",'BİLGİ GİRİŞİ'!AJ60)","v":""},null,null,{"$f":"IF('BİLGİ GİRİŞİ'!AN60=\"\",\"\",'BİLGİ GİRİŞİ'!AN60)","v":""},null,null,{"$f":"IF('BİLGİ GİRİŞİ'!AR60=\"\",\"\",'BİLGİ GİRİŞİ'!AR60)","v":""},null,null,{"$f":"IF('BİLGİ GİRİŞİ'!AV60=\"\",\"\",'BİLGİ GİRİŞİ'!AV60)","v":""},null,null,"",null,null,""]
[{"$f":"IF('BİLGİ GİRİŞİ'!D61=\"\",\"\",'BİLGİ GİRİŞİ'!D61)","v":""},{"$f":"IF('BİLGİ GİRİŞİ'!E61=\"\",\"\",'BİLGİ GİRİŞİ'!E61)","v":""},null,null,null,null,null,null,null,null,null,null,null,null,null,{"$f":"IF('BİLGİ GİRİŞİ'!W61=\"\",\"\",'BİLGİ GİRİŞİ'!W61)","v":""},null,null,null,{"$f":"IF('BİLGİ GİRİŞİ'!T61=\"\",\"\",'BİLGİ GİRİŞİ'!T61)","v":""},null,null,null,{"$f":"IF('BİLGİ GİRİŞİ'!AB61=\"\",\"\",'BİLGİ GİRİŞİ'!AB61)","v":""},null,null,{"$f":"IF('BİLGİ GİRİŞİ'!AF61=\"\",\"\",'BİLGİ GİRİŞİ'!AF61)","v":""},null,null,{"$f":"IF('BİLGİ GİRİŞİ'!AJ61=\"\",\"\",'BİLGİ GİRİŞİ'!AJ61)","v":""},null,null,{"$f":"IF('BİLGİ GİRİŞİ'!AN61=\"\",\"\",'BİLGİ GİRİŞİ'!AN61)","v":""},null,null,{"$f":"IF('BİLGİ GİRİŞİ'!AR61=\"\",\"\",'BİLGİ GİRİŞİ'!AR61)","v":""},null,null,{"$f":"IF('BİLGİ GİRİŞİ'!AV61=\"\",\"\",'BİLGİ GİRİŞİ'!AV61)","v":""},null,null,"",null,null,""]
[{"$f":"IF('BİLGİ GİRİŞİ'!D62=\"\",\"\",'BİLGİ GİRİŞİ'!D62)","v":""},{"$f":"IF('BİLGİ GİRİŞİ'!E62=\"\",\"\",'BİLGİ GİRİŞİ'!E62)","v":""},null,null,null,null,null,null,null,null,null,null,null,null,null,{"$f":"IF('BİLGİ GİRİŞİ'!W62=\"\",\"\",'BİLGİ GİRİŞİ'!W62)","v":""},null,null,null,{"$f":"IF('BİLGİ GİRİŞİ'!T62=\"\",\"\",'BİLGİ GİRİŞİ'!T62)","v":""},null,null,null,{"$f":"IF('BİLGİ GİRİŞİ'!AB62=\"\",\"\",'BİLGİ GİRİŞİ'!AB62)","v":""},null,null,{"$f":"IF('BİLGİ GİRİŞİ'!AF62=\"\",\"\",'BİLGİ GİRİŞİ'!AF62)","v":""},null,null,{"$f":"IF('BİLGİ GİRİŞİ'!AJ62=\"\",\"\",'BİLGİ GİRİŞİ'!AJ62)","v":""},null,null,{"$f":"IF('BİLGİ GİRİŞİ'!AN62=\"\",\"\",'BİLGİ GİRİŞİ'!AN62)","v":""},null,null,{"$f":"IF('BİLGİ GİRİŞİ'!AR62=\"\",\"\",'BİLGİ GİRİŞİ'!AR62)","v":""},null,null,{"$f":"IF('BİLGİ GİRİŞİ'!AV62=\"\",\"\",'BİLGİ GİRİŞİ'!AV62)","v":""},null,null,"",null,null,""]
[{"$f":"IF('BİLGİ GİRİŞİ'!D63=\"\",\"\",'BİLGİ GİRİŞİ'!D63)","v":""},{"$f":"IF('BİLGİ GİRİŞİ'!E63=\"\",\"\",'BİLGİ GİRİŞİ'!E63)","v":""},null,null,null,null,null,null,null,null,null,null,null,null,null,{"$f":"IF('BİLGİ GİRİŞİ'!W63=\"\",\"\",'BİLGİ GİRİŞİ'!W63)","v":""},null,null,null,{"$f":"IF('BİLGİ GİRİŞİ'!T63=\"\",\"\",'BİLGİ GİRİŞİ'!T63)","v":""},null,null,null,{"$f":"IF('BİLGİ GİRİŞİ'!AB63=\"\",\"\",'BİLGİ GİRİŞİ'!AB63)","v":""},null,null,{"$f":"IF('BİLGİ GİRİŞİ'!AF63=\"\",\"\",'BİLGİ GİRİŞİ'!AF63)","v":""},null,null,{"$f":"IF('BİLGİ GİRİŞİ'!AJ63=\"\",\"\",'BİLGİ GİRİŞİ'!AJ63)","v":""},null,null,{"$f":"IF('BİLGİ GİRİŞİ'!AN63=\"\",\"\",'BİLGİ GİRİŞİ'!AN63)","v":""},null,null,{"$f":"IF('BİLGİ GİRİŞİ'!AR63=\"\",\"\",'BİLGİ GİRİŞİ'!AR63)","v":""},null,null,{"$f":"IF('BİLGİ GİRİŞİ'!AV63=\"\",\"\",'BİLGİ GİRİŞİ'!AV63)","v":""},null,null,"",null,null,""]
[{"$f":"IF('BİLGİ GİRİŞİ'!D64=\"\",\"\",'BİLGİ GİRİŞİ'!D64)","v":""},{"$f":"IF('BİLGİ GİRİŞİ'!E64=\"\",\"\",'BİLGİ GİRİŞİ'!E64)","v":""},null,null,null,null,null,null,null,null,null,null,null,null,null,{"$f":"IF('BİLGİ GİRİŞİ'!W64=\"\",\"\",'BİLGİ GİRİŞİ'!W64)","v":""},null,null,null,{"$f":"IF('BİLGİ GİRİŞİ'!T64=\"\",\"\",'BİLGİ GİRİŞİ'!T64)","v":""},null,null,null,{"$f":"IF('BİLGİ GİRİŞİ'!AB64=\"\",\"\",'BİLGİ GİRİŞİ'!AB64)","v":""},null,null,{"$f":"IF('BİLGİ GİRİŞİ'!AF64=\"\",\"\",'BİLGİ GİRİŞİ'!AF64)","v":""},null,null,{"$f":"IF('BİLGİ GİRİŞİ'!AJ64=\"\",\"\",'BİLGİ GİRİŞİ'!AJ64)","v":""},null,null,{"$f":"IF('BİLGİ GİRİŞİ'!AN64=\"\",\"\",'BİLGİ GİRİŞİ'!AN64)","v":""},null,null,{"$f":"IF('BİLGİ GİRİŞİ'!AR64=\"\",\"\",'BİLGİ GİRİŞİ'!AR64)","v":""},null,null,{"$f":"IF('BİLGİ GİRİŞİ'!AV64=\"\",\"\",'BİLGİ GİRİŞİ'!AV64)","v":""},null,null,"",null,null,""]
[{"$f":"IF('BİLGİ GİRİŞİ'!D65=\"\",\"\",'BİLGİ GİRİŞİ'!D65)","v":""},{"$f":"IF('BİLGİ GİRİŞİ'!E65=\"\",\"\",'BİLGİ GİRİŞİ'!E65)","v":""},null,null,null,null,null,null,null,null,null,null,null,null,null,{"$f":"IF('BİLGİ GİRİŞİ'!W65=\"\",\"\",'BİLGİ GİRİŞİ'!W65)","v":""},null,null,null,{"$f":"IF('BİLGİ GİRİŞİ'!T65=\"\",\"\",'BİLGİ GİRİŞİ'!T65)","v":""},null,null,null,{"$f":"IF('BİLGİ GİRİŞİ'!AB65=\"\",\"\",'BİLGİ GİRİŞİ'!AB65)","v":""},null,null,{"$f":"IF('BİLGİ GİRİŞİ'!AF65=\"\",\"\",'BİLGİ GİRİŞİ'!AF65)","v":""},null,null,{"$f":"IF('BİLGİ GİRİŞİ'!AJ65=\"\",\"\",'BİLGİ GİRİŞİ'!AJ65)","v":""},null,null,{"$f":"IF('BİLGİ GİRİŞİ'!AN65=\"\",\"\",'BİLGİ GİRİŞİ'!AN65)","v":""},null,null,{"$f":"IF('BİLGİ GİRİŞİ'!AR65=\"\",\"\",'BİLGİ GİRİŞİ'!AR65)","v":""},null,null,{"$f":"IF('BİLGİ GİRİŞİ'!AV65=\"\",\"\",'BİLGİ GİRİŞİ'!AV65)","v":""},null,null,"",null,null,""]
[{"$f":"IF('BİLGİ GİRİŞİ'!D66=\"\",\"\",'BİLGİ GİRİŞİ'!D66)","v":""},{"$f":"IF('BİLGİ GİRİŞİ'!E66=\"\",\"\",'BİLGİ GİRİŞİ'!E66)","v":""},null,null,null,null,null,null,null,null,null,null,null,null,null,{"$f":"IF('BİLGİ GİRİŞİ'!W66=\"\",\"\",'BİLGİ GİRİŞİ'!W66)","v":""},null,null,null,{"$f":"IF('BİLGİ GİRİŞİ'!T66=\"\",\"\",'BİLGİ GİRİŞİ'!T66)","v":""},null,null,null,{"$f":"IF('BİLGİ GİRİŞİ'!AB66=\"\",\"\",'BİLGİ GİRİŞİ'!AB66)","v":""},null,null,{"$f":"IF('BİLGİ GİRİŞİ'!AF66=\"\",\"\",'BİLGİ GİRİŞİ'!AF66)","v":""},null,null,{"$f":"IF('BİLGİ GİRİŞİ'!AJ66=\"\",\"\",'BİLGİ GİRİŞİ'!AJ66)","v":""},null,null,{"$f":"IF('BİLGİ GİRİŞİ'!AN66=\"\",\"\",'BİLGİ GİRİŞİ'!AN66)","v":""},null,null,{"$f":"IF('BİLGİ GİRİŞİ'!AR66=\"\",\"\",'BİLGİ GİRİŞİ'!AR66)","v":""},null,null,{"$f":"IF('BİLGİ GİRİŞİ'!AV66=\"\",\"\",'BİLGİ GİRİŞİ'!AV66)","v":""},null,null,"",null,null,""]
[{"$f":"IF('BİLGİ GİRİŞİ'!D67=\"\",\"\",'BİLGİ GİRİŞİ'!D67)","v":""},{"$f":"IF('BİLGİ GİRİŞİ'!E67=\"\",\"\",'BİLGİ GİRİŞİ'!E67)","v":""},null,null,null,null,null,null,null,null,null,null,null,null,null,{"$f":"IF('BİLGİ GİRİŞİ'!W67=\"\",\"\",'BİLGİ GİRİŞİ'!W67)","v":""},null,null,null,{"$f":"IF('BİLGİ GİRİŞİ'!T67=\"\",\"\",'BİLGİ GİRİŞİ'!T67)","v":""},null,null,null,{"$f":"IF('BİLGİ GİRİŞİ'!AB67=\"\",\"\",'BİLGİ GİRİŞİ'!AB67)","v":""},null,null,{"$f":"IF('BİLGİ GİRİŞİ'!AF67=\"\",\"\",'BİLGİ GİRİŞİ'!AF67)","v":""},null,null,{"$f":"IF('BİLGİ GİRİŞİ'!AJ67=\"\",\"\",'BİLGİ GİRİŞİ'!AJ67)","v":""},null,null,{"$f":"IF('BİLGİ GİRİŞİ'!AN67=\"\",\"\",'BİLGİ GİRİŞİ'!AN67)","v":""},null,null,{"$f":"IF('BİLGİ GİRİŞİ'!AR67=\"\",\"\",'BİLGİ GİRİŞİ'!AR67)","v":""},null,null,{"$f":"IF('BİLGİ GİRİŞİ'!AV67=\"\",\"\",'BİLGİ GİRİŞİ'!AV67)","v":""},null,null,"",null,null,""]
[{"$f":"IF('BİLGİ GİRİŞİ'!D68=\"\",\"\",'BİLGİ GİRİŞİ'!D68)","v":""},{"$f":"IF('BİLGİ GİRİŞİ'!E68=\"\",\"\",'BİLGİ GİRİŞİ'!E68)","v":""},null,null,null,null,null,null,null,null,null,null,null,null,null,{"$f":"IF('BİLGİ GİRİŞİ'!W68=\"\",\"\",'BİLGİ GİRİŞİ'!W68)","v":""},null,null,null,{"$f":"IF('BİLGİ GİRİŞİ'!T68=\"\",\"\",'BİLGİ GİRİŞİ'!T68)","v":""},null,null,null,{"$f":"IF('BİLGİ GİRİŞİ'!AB68=\"\",\"\",'BİLGİ GİRİŞİ'!AB68)","v":""},null,null,{"$f":"IF('BİLGİ GİRİŞİ'!AF68=\"\",\"\",'BİLGİ GİRİŞİ'!AF68)","v":""},null,null,{"$f":"IF('BİLGİ GİRİŞİ'!AJ68=\"\",\"\",'BİLGİ GİRİŞİ'!AJ68)","v":""},null,null,{"$f":"IF('BİLGİ GİRİŞİ'!AN68=\"\",\"\",'BİLGİ GİRİŞİ'!AN68)","v":""},null,null,{"$f":"IF('BİLGİ GİRİŞİ'!AR68=\"\",\"\",'BİLGİ GİRİŞİ'!AR68)","v":""},null,null,{"$f":"IF('BİLGİ GİRİŞİ'!AV68=\"\",\"\",'BİLGİ GİRİŞİ'!AV68)","v":""},null,null,"",null,null,""]
[{"$f":"IF('BİLGİ GİRİŞİ'!D69=\"\",\"\",'BİLGİ GİRİŞİ'!D69)","v":""},{"$f":"IF('BİLGİ GİRİŞİ'!E69=\"\",\"\",'BİLGİ GİRİŞİ'!E69)","v":""},null,null,null,null,null,null,null,null,null,null,null,null,null,{"$f":"IF('BİLGİ GİRİŞİ'!W69=\"\",\"\",'BİLGİ GİRİŞİ'!W69)","v":""},null,null,null,{"$f":"IF('BİLGİ GİRİŞİ'!T69=\"\",\"\",'BİLGİ GİRİŞİ'!T69)","v":""},null,null,null,{"$f":"IF('BİLGİ GİRİŞİ'!AB69=\"\",\"\",'BİLGİ GİRİŞİ'!AB69)","v":""},null,null,{"$f":"IF('BİLGİ GİRİŞİ'!AF69=\"\",\"\",'BİLGİ GİRİŞİ'!AF69)","v":""},null,null,{"$f":"IF('BİLGİ GİRİŞİ'!AJ69=\"\",\"\",'BİLGİ GİRİŞİ'!AJ69)","v":""},null,null,{"$f":"IF('BİLGİ GİRİŞİ'!AN69=\"\",\"\",'BİLGİ GİRİŞİ'!AN69)","v":""},null,null,{"$f":"IF('BİLGİ GİRİŞİ'!AR69=\"\",\"\",'BİLGİ GİRİŞİ'!AR69)","v":""},null,null,{"$f":"IF('BİLGİ GİRİŞİ'!AV69=\"\",\"\",'BİLGİ GİRİŞİ'!AV69)","v":""},null,null,{"$f":"IF(P55=\"\",\"\",(X55+AD55+AJ55)/3)","v":""},null,null,{"$f":"IF(P55=\"\",\"\",(AA55+AG55+AM55)/3)","v":""}]
[{"$f":"IF('BİLGİ GİRİŞİ'!D70=\"\",\"\",'BİLGİ GİRİŞİ'!D70)","v":""},{"$f":"IF('BİLGİ GİRİŞİ'!E70=\"\",\"\",'BİLGİ GİRİŞİ'!E70)","v":""},null,null,null,null,null,null,null,null,null,null,null,null,null,{"$f":"IF('BİLGİ GİRİŞİ'!W70=\"\",\"\",'BİLGİ GİRİŞİ'!W70)","v":""},null,null,null,{"$f":"IF('BİLGİ GİRİŞİ'!T70=\"\",\"\",'BİLGİ GİRİŞİ'!T70)","v":""},null,null,null,{"$f":"IF('BİLGİ GİRİŞİ'!AB70=\"\",\"\",'BİLGİ GİRİŞİ'!AB70)","v":""},null,null,{"$f":"IF('BİLGİ GİRİŞİ'!AF70=\"\",\"\",'BİLGİ GİRİŞİ'!AF70)","v":""},null,null,{"$f":"IF('BİLGİ GİRİŞİ'!AJ70=\"\",\"\",'BİLGİ GİRİŞİ'!AJ70)","v":""},null,null,{"$f":"IF('BİLGİ GİRİŞİ'!AN70=\"\",\"\",'BİLGİ GİRİŞİ'!AN70)","v":""},null,null,{"$f":"IF('BİLGİ GİRİŞİ'!AR70=\"\",\"\",'BİLGİ GİRİŞİ'!AR70)","v":""},null,null,{"$f":"IF('BİLGİ GİRİŞİ'!AV70=\"\",\"\",'BİLGİ GİRİŞİ'!AV70)","v":""},null,null,"",null,null,""]
[{"$f":"IF('BİLGİ GİRİŞİ'!D71=\"\",\"\",'BİLGİ GİRİŞİ'!D71)","v":""},{"$f":"IF('BİLGİ GİRİŞİ'!E71=\"\",\"\",'BİLGİ GİRİŞİ'!E71)","v":""},null,null,null,null,null,null,null,null,null,null,null,null,null,{"$f":"IF('BİLGİ GİRİŞİ'!W71=\"\",\"\",'BİLGİ GİRİŞİ'!W71)","v":""},null,null,null,{"$f":"IF('BİLGİ GİRİŞİ'!T71=\"\",\"\",'BİLGİ GİRİŞİ'!T71)","v":""},null,null,null,{"$f":"IF('BİLGİ GİRİŞİ'!AB71=\"\",\"\",'BİLGİ GİRİŞİ'!AB71)","v":""},null,null,{"$f":"IF('BİLGİ GİRİŞİ'!AF71=\"\",\"\",'BİLGİ GİRİŞİ'!AF71)","v":""},null,null,{"$f":"IF('BİLGİ GİRİŞİ'!AJ71=\"\",\"\",'BİLGİ GİRİŞİ'!AJ71)","v":""},null,null,{"$f":"IF('BİLGİ GİRİŞİ'!AN71=\"\",\"\",'BİLGİ GİRİŞİ'!AN71)","v":""},null,null,{"$f":"IF('BİLGİ GİRİŞİ'!AR71=\"\",\"\",'BİLGİ GİRİŞİ'!AR71)","v":""},null,null,{"$f":"IF('BİLGİ GİRİŞİ'!AV71=\"\",\"\",'BİLGİ GİRİŞİ'!AV71)","v":""},null,null,"",null,null,""]
[{"$f":"IF('BİLGİ GİRİŞİ'!D72=\"\",\"\",'BİLGİ GİRİŞİ'!D72)","v":""},{"$f":"IF('BİLGİ GİRİŞİ'!E72=\"\",\"\",'BİLGİ GİRİŞİ'!E72)","v":""},null,null,null,null,null,null,null,null,null,null,null,null,null,{"$f":"IF('BİLGİ GİRİŞİ'!W72=\"\",\"\",'BİLGİ GİRİŞİ'!W72)","v":""},null,null,null,{"$f":"IF('BİLGİ GİRİŞİ'!T72=\"\",\"\",'BİLGİ GİRİŞİ'!T72)","v":""},null,null,null,{"$f":"IF('BİLGİ GİRİŞİ'!AB72=\"\",\"\",'BİLGİ GİRİŞİ'!AB72)","v":""},null,null,{"$f":"IF('BİLGİ GİRİŞİ'!AF72=\"\",\"\",'BİLGİ GİRİŞİ'!AF72)","v":""},null,null,{"$f":"IF('BİLGİ GİRİŞİ'!AJ72=\"\",\"\",'BİLGİ GİRİŞİ'!AJ72)","v":""},null,null,{"$f":"IF('BİLGİ GİRİŞİ'!AN72=\"\",\"\",'BİLGİ GİRİŞİ'!AN72)","v":""},null,null,{"$f":"IF('BİLGİ GİRİŞİ'!AR72=\"\",\"\",'BİLGİ GİRİŞİ'!AR72)","v":""},null,null,{"$f":"IF('BİLGİ GİRİŞİ'!AV72=\"\",\"\",'BİLGİ GİRİŞİ'!AV72)","v":""},null,null,"",null,null,""]
[{"$f":"IF('BİLGİ GİRİŞİ'!D73=\"\",\"\",'BİLGİ GİRİŞİ'!D73)","v":""},{"$f":"IF('BİLGİ GİRİŞİ'!E73=\"\",\"\",'BİLGİ GİRİŞİ'!E73)","v":""},null,null,null,null,null,null,null,null,null,null,null,null,null,{"$f":"IF('BİLGİ GİRİŞİ'!W73=\"\",\"\",'BİLGİ GİRİŞİ'!W73)","v":""},null,null,null,{"$f":"IF('BİLGİ GİRİŞİ'!T73=\"\",\"\",'BİLGİ GİRİŞİ'!T73)","v":""},null,null,null,{"$f":"IF('BİLGİ GİRİŞİ'!AB73=\"\",\"\",'BİLGİ GİRİŞİ'!AB73)","v":""},null,null,{"$f":"IF('BİLGİ GİRİŞİ'!AF73=\"\",\"\",'BİLGİ GİRİŞİ'!AF73)","v":""},null,null,{"$f":"IF('BİLGİ GİRİŞİ'!AJ73=\"\",\"\",'BİLGİ GİRİŞİ'!AJ73)","v":""},null,null,{"$f":"IF('BİLGİ GİRİŞİ'!AN73=\"\",\"\",'BİLGİ GİRİŞİ'!AN73)","v":""},null,null,{"$f":"IF('BİLGİ GİRİŞİ'!AR73=\"\",\"\",'BİLGİ GİRİŞİ'!AR73)","v":""},null,null,{"$f":"IF('BİLGİ GİRİŞİ'!AV73=\"\",\"\",'BİLGİ GİRİŞİ'!AV73)","v":""},null,null,"",null,null,""]
[{"$f":"IF('BİLGİ GİRİŞİ'!D74=\"\",\"\",'BİLGİ GİRİŞİ'!D74)","v":""},{"$f":"IF('BİLGİ GİRİŞİ'!E74=\"\",\"\",'BİLGİ GİRİŞİ'!E74)","v":""},null,null,null,null,null,null,null,null,null,null,null,null,null,{"$f":"IF('BİLGİ GİRİŞİ'!W74=\"\",\"\",'BİLGİ GİRİŞİ'!W74)","v":""},null,null,null,{"$f":"IF('BİLGİ GİRİŞİ'!T74=\"\",\"\",'BİLGİ GİRİŞİ'!T74)","v":""},null,null,null,{"$f":"IF('BİLGİ GİRİŞİ'!AB74=\"\",\"\",'BİLGİ GİRİŞİ'!AB74)","v":""},null,null,{"$f":"IF('BİLGİ GİRİŞİ'!AF74=\"\",\"\",'BİLGİ GİRİŞİ'!AF74)","v":""},null,null,{"$f":"IF('BİLGİ GİRİŞİ'!AJ74=\"\",\"\",'BİLGİ GİRİŞİ'!AJ74)","v":""},null,null,{"$f":"IF('BİLGİ GİRİŞİ'!AN74=\"\",\"\",'BİLGİ GİRİŞİ'!AN74)","v":""},null,null,{"$f":"IF('BİLGİ GİRİŞİ'!AR74=\"\",\"\",'BİLGİ GİRİŞİ'!AR74)","v":""},null,null,{"$f":"IF('BİLGİ GİRİŞİ'!AV74=\"\",\"\",'BİLGİ GİRİŞİ'!AV74)","v":""},null,null,"",null,null,""]
[{"$f":"IF('BİLGİ GİRİŞİ'!D75=\"\",\"\",'BİLGİ GİRİŞİ'!D75)","v":""},{"$f":"IF('BİLGİ GİRİŞİ'!E75=\"\",\"\",'BİLGİ GİRİŞİ'!E75)","v":""},null,null,null,null,null,null,null,null,null,null,null,null,null,{"$f":"IF('BİLGİ GİRİŞİ'!W75=\"\",\"\",'BİLGİ GİRİŞİ'!W75)","v":""},null,null,null,{"$f":"IF('BİLGİ GİRİŞİ'!T75=\"\",\"\",'BİLGİ GİRİŞİ'!T75)","v":""},null,null,null,{"$f":"IF('BİLGİ GİRİŞİ'!AB75=\"\",\"\",'BİLGİ GİRİŞİ'!AB75)","v":""},null,null,{"$f":"IF('BİLGİ GİRİŞİ'!AF75=\"\",\"\",'BİLGİ GİRİŞİ'!AF75)","v":""},null,null,{"$f":"IF('BİLGİ GİRİŞİ'!AJ75=\"\",\"\",'BİLGİ GİRİŞİ'!AJ75)","v":""},null,null,{"$f":"IF('BİLGİ GİRİŞİ'!AN75=\"\",\"\",'BİLGİ GİRİŞİ'!AN75)","v":""},null,null,{"$f":"IF('BİLGİ GİRİŞİ'!AR75=\"\",\"\",'BİLGİ GİRİŞİ'!AR75)","v":""},null,null,{"$f":"IF('BİLGİ GİRİŞİ'!AV75=\"\",\"\",'BİLGİ GİRİŞİ'!AV75)","v":""},null,null,"",null,null,""]
[{"$f":"IF('BİLGİ GİRİŞİ'!D76=\"\",\"\",'BİLGİ GİRİŞİ'!D76)","v":""},{"$f":"IF('BİLGİ GİRİŞİ'!E76=\"\",\"\",'BİLGİ GİRİŞİ'!E76)","v":""},null,null,null,null,null,null,null,null,null,null,null,null,null,{"$f":"IF('BİLGİ GİRİŞİ'!W76=\"\",\"\",'BİLGİ GİRİŞİ'!W76)","v":""},null,null,null,{"$f":"IF('BİLGİ GİRİŞİ'!T76=\"\",\"\",'BİLGİ GİRİŞİ'!T76)","v":""},null,null,null,{"$f":"IF('BİLGİ GİRİŞİ'!AB76=\"\",\"\",'BİLGİ GİRİŞİ'!AB76)","v":""},null,null,{"$f":"IF('BİLGİ GİRİŞİ'!AF76=\"\",\"\",'BİLGİ GİRİŞİ'!AF76)","v":""},null,null,{"$f":"IF('BİLGİ GİRİŞİ'!AJ76=\"\",\"\",'BİLGİ GİRİŞİ'!AJ76)","v":""},null,null,{"$f":"IF('BİLGİ GİRİŞİ'!AN76=\"\",\"\",'BİLGİ GİRİŞİ'!AN76)","v":""},null,null,{"$f":"IF('BİLGİ GİRİŞİ'!AR76=\"\",\"\",'BİLGİ GİRİŞİ'!AR76)","v":""},null,null,{"$f":"IF('BİLGİ GİRİŞİ'!AV76=\"\",\"\",'BİLGİ GİRİŞİ'!AV76)","v":""},null,null,"",null,null,""]
[{"$f":"IF('BİLGİ GİRİŞİ'!D77=\"\",\"\",'BİLGİ GİRİŞİ'!D77)","v":""},{"$f":"IF('BİLGİ GİRİŞİ'!E77=\"\",\"\",'BİLGİ GİRİŞİ'!E77)","v":""},null,null,null,null,null,null,null,null,null,null,null,null,null,{"$f":"IF('BİLGİ GİRİŞİ'!W77=\"\",\"\",'BİLGİ GİRİŞİ'!W77)","v":""},null,null,null,{"$f":"IF('BİLGİ GİRİŞİ'!T77=\"\",\"\",'BİLGİ GİRİŞİ'!T77)","v":""},null,null,null,{"$f":"IF('BİLGİ GİRİŞİ'!AB77=\"\",\"\",'BİLGİ GİRİŞİ'!AB77)","v":""},null,null,{"$f":"IF('BİLGİ GİRİŞİ'!AF77=\"\",\"\",'BİLGİ GİRİŞİ'!AF77)","v":""},null,null,{"$f":"IF('BİLGİ GİRİŞİ'!AJ77=\"\",\"\",'BİLGİ GİRİŞİ'!AJ77)","v":""},null,null,{"$f":"IF('BİLGİ GİRİŞİ'!AN77=\"\",\"\",'BİLGİ GİRİŞİ'!AN77)","v":""},null,null,{"$f":"IF('BİLGİ GİRİŞİ'!AR77=\"\",\"\",'BİLGİ GİRİŞİ'!AR77)","v":""},null,null,{"$f":"IF('BİLGİ GİRİŞİ'!AV77=\"\",\"\",'BİLGİ GİRİŞİ'!AV77)","v":""},null,null,"",null,null,""]
[{"$f":"IF('BİLGİ GİRİŞİ'!D78=\"\",\"\",'BİLGİ GİRİŞİ'!D78)","v":""},{"$f":"IF('BİLGİ GİRİŞİ'!E78=\"\",\"\",'BİLGİ GİRİŞİ'!E78)","v":""},null,null,null,null,null,null,null,null,null,null,null,null,null,{"$f":"IF('BİLGİ GİRİŞİ'!W78=\"\",\"\",'BİLGİ GİRİŞİ'!W78)","v":""},null,null,null,{"$f":"IF('BİLGİ GİRİŞİ'!T78=\"\",\"\",'BİLGİ GİRİŞİ'!T78)","v":""},null,null,null,{"$f":"IF('BİLGİ GİRİŞİ'!AB78=\"\",\"\",'BİLGİ GİRİŞİ'!AB78)","v":""},null,null,{"$f":"IF('BİLGİ GİRİŞİ'!AF78=\"\",\"\",'BİLGİ GİRİŞİ'!AF78)","v":""},null,null,{"$f":"IF('BİLGİ GİRİŞİ'!AJ78=\"\",\"\",'BİLGİ GİRİŞİ'!AJ78)","v":""},null,null,{"$f":"IF('BİLGİ GİRİŞİ'!AN78=\"\",\"\",'BİLGİ GİRİŞİ'!AN78)","v":""},null,null,{"$f":"IF('BİLGİ GİRİŞİ'!AR78=\"\",\"\",'BİLGİ GİRİŞİ'!AR78)","v":""},null,null,{"$f":"IF('BİLGİ GİRİŞİ'!AV78=\"\",\"\",'BİLGİ GİRİŞİ'!AV78)","v":""},null,null,"",null,null,""]
[{"$f":"IF('BİLGİ GİRİŞİ'!D79=\"\",\"\",'BİLGİ GİRİŞİ'!D79)","v":""},{"$f":"IF('BİLGİ GİRİŞİ'!E79=\"\",\"\",'BİLGİ GİRİŞİ'!E79)","v":""},null,null,null,null,null,null,null,null,null,null,null,null,null,{"$f":"IF('BİLGİ GİRİŞİ'!W79=\"\",\"\",'BİLGİ GİRİŞİ'!W79)","v":""},null,null,null,{"$f":"IF('BİLGİ GİRİŞİ'!T79=\"\",\"\",'BİLGİ GİRİŞİ'!T79)","v":""},null,null,null,{"$f":"IF('BİLGİ GİRİŞİ'!AB79=\"\",\"\",'BİLGİ GİRİŞİ'!AB79)","v":""},null,null,{"$f":"IF('BİLGİ GİRİŞİ'!AF79=\"\",\"\",'BİLGİ GİRİŞİ'!AF79)","v":""},null,null,{"$f":"IF('BİLGİ GİRİŞİ'!AJ79=\"\",\"\",'BİLGİ GİRİŞİ'!AJ79)","v":""},null,null,{"$f":"IF('BİLGİ GİRİŞİ'!AN79=\"\",\"\",'BİLGİ GİRİŞİ'!AN79)","v":""},null,null,{"$f":"IF('BİLGİ GİRİŞİ'!AR79=\"\",\"\",'BİLGİ GİRİŞİ'!AR79)","v":""},null,null,{"$f":"IF('BİLGİ GİRİŞİ'!AV79=\"\",\"\",'BİLGİ GİRİŞİ'!AV79)","v":""},null,null,"",null,null,""]
[{"$f":"IF('BİLGİ GİRİŞİ'!D80=\"\",\"\",'BİLGİ GİRİŞİ'!D80)","v":""},{"$f":"IF('BİLGİ GİRİŞİ'!E80=\"\",\"\",'BİLGİ GİRİŞİ'!E80)","v":""},null,null,null,null,null,null,null,null,null,null,null,null,null,{"$f":"IF('BİLGİ GİRİŞİ'!W80=\"\",\"\",'BİLGİ GİRİŞİ'!W80)","v":""},null,null,null,{"$f":"IF('BİLGİ GİRİŞİ'!T80=\"\",\"\",'BİLGİ GİRİŞİ'!T80)","v":""},null,null,null,{"$f":"IF('BİLGİ GİRİŞİ'!AB80=\"\",\"\",'BİLGİ GİRİŞİ'!AB80)","v":""},null,null,{"$f":"IF('BİLGİ GİRİŞİ'!AF80=\"\",\"\",'BİLGİ GİRİŞİ'!AF80)","v":""},null,null,{"$f":"IF('BİLGİ GİRİŞİ'!AJ80=\"\",\"\",'BİLGİ GİRİŞİ'!AJ80)","v":""},null,null,{"$f":"IF('BİLGİ GİRİŞİ'!AN80=\"\",\"\",'BİLGİ GİRİŞİ'!AN80)","v":""},null,null,{"$f":"IF('BİLGİ GİRİŞİ'!AR80=\"\",\"\",'BİLGİ GİRİŞİ'!AR80)","v":""},null,null,{"$f":"IF('BİLGİ GİRİŞİ'!AV80=\"\",\"\",'BİLGİ GİRİŞİ'!AV80)","v":""},null,null,"",null,null,""]
[{"$f":"IF('BİLGİ GİRİŞİ'!D81=\"\",\"\",'BİLGİ GİRİŞİ'!D81)","v":""},{"$f":"IF('BİLGİ GİRİŞİ'!E81=\"\",\"\",'BİLGİ GİRİŞİ'!E81)","v":""},null,null,null,null,null,null,null,null,null,null,null,null,null,{"$f":"IF('BİLGİ GİRİŞİ'!W81=\"\",\"\",'BİLGİ GİRİŞİ'!W81)","v":""},null,null,null,{"$f":"IF('BİLGİ GİRİŞİ'!T81=\"\",\"\",'BİLGİ GİRİŞİ'!T81)","v":""},null,null,null,{"$f":"IF('BİLGİ GİRİŞİ'!AB81=\"\",\"\",'BİLGİ GİRİŞİ'!AB81)","v":""},null,null,{"$f":"IF('BİLGİ GİRİŞİ'!AF81=\"\",\"\",'BİLGİ GİRİŞİ'!AF81)","v":""},null,null,{"$f":"IF('BİLGİ GİRİŞİ'!AJ81=\"\",\"\",'BİLGİ GİRİŞİ'!AJ81)","v":""},null,null,{"$f":"IF('BİLGİ GİRİŞİ'!AN81=\"\",\"\",'BİLGİ GİRİŞİ'!AN81)","v":""},null,null,{"$f":"IF('BİLGİ GİRİŞİ'!AR81=\"\",\"\",'BİLGİ GİRİŞİ'!AR81)","v":""},null,null,{"$f":"IF('BİLGİ GİRİŞİ'!AV81=\"\",\"\",'BİLGİ GİRİŞİ'!AV81)","v":""},null,null,"",null,null,""]
[{"$f":"IF('BİLGİ GİRİŞİ'!D82=\"\",\"\",'BİLGİ GİRİŞİ'!D82)","v":""},{"$f":"IF('BİLGİ GİRİŞİ'!E82=\"\",\"\",'BİLGİ GİRİŞİ'!E82)","v":""},null,null,null,null,null,null,null,null,null,null,null,null,null,{"$f":"IF('BİLGİ GİRİŞİ'!W82=\"\",\"\",'BİLGİ GİRİŞİ'!W82)","v":""},null,null,null,{"$f":"IF('BİLGİ GİRİŞİ'!T82=\"\",\"\",'BİLGİ GİRİŞİ'!T82)","v":""},null,null,null,{"$f":"IF('BİLGİ GİRİŞİ'!AB82=\"\",\"\",'BİLGİ GİRİŞİ'!AB82)","v":""},null,null,{"$f":"IF('BİLGİ GİRİŞİ'!AF82=\"\",\"\",'BİLGİ GİRİŞİ'!AF82)","v":""},null,null,{"$f":"IF('BİLGİ GİRİŞİ'!AJ82=\"\",\"\",'BİLGİ GİRİŞİ'!AJ82)","v":""},null,null,{"$f":"IF('BİLGİ GİRİŞİ'!AN82=\"\",\"\",'BİLGİ GİRİŞİ'!AN82)","v":""},null,null,{"$f":"IF('BİLGİ GİRİŞİ'!AR82=\"\",\"\",'BİLGİ GİRİŞİ'!AR82)","v":""},null,null,{"$f":"IF('BİLGİ GİRİŞİ'!AV82=\"\",\"\",'BİLGİ GİRİŞİ'!AV82)","v":""},null,null,"",null,null,""]
[{"$f":"IF('BİLGİ GİRİŞİ'!D83=\"\",\"\",'BİLGİ GİRİŞİ'!D83)","v":""},{"$f":"IF('BİLGİ GİRİŞİ'!E83=\"\",\"\",'BİLGİ GİRİŞİ'!E83)","v":""},null,null,null,null,null,null,null,null,null,null,null,null,null,{"$f":"IF('BİLGİ GİRİŞİ'!W83=\"\",\"\",'BİLGİ GİRİŞİ'!W83)","v":""},null,null,null,{"$f":"IF('BİLGİ GİRİŞİ'!T83=\"\",\"\",'BİLGİ GİRİŞİ'!T83)","v":""},null,null,null,{"$f":"IF('BİLGİ GİRİŞİ'!AB83=\"\",\"\",'BİLGİ GİRİŞİ'!AB83)","v":""},null,null,{"$f":"IF('BİLGİ GİRİŞİ'!AF83=\"\",\"\",'BİLGİ GİRİŞİ'!AF83)","v":""},null,null,{"$f":"IF('BİLGİ GİRİŞİ'!AJ83=\"\",\"\",'BİLGİ GİRİŞİ'!AJ83)","v":""},null,null,{"$f":"IF('BİLGİ GİRİŞİ'!AN83=\"\",\"\",'BİLGİ GİRİŞİ'!AN83)","v":""},null,null,{"$f":"IF('BİLGİ GİRİŞİ'!AR83=\"\",\"\",'BİLGİ GİRİŞİ'!AR83)","v":""},null,null,{"$f":"IF('BİLGİ GİRİŞİ'!AV83=\"\",\"\",'BİLGİ GİRİŞİ'!AV83)","v":""},null,null,"",null,null,""]
[{"$f":"IF('BİLGİ GİRİŞİ'!D84=\"\",\"\",'BİLGİ GİRİŞİ'!D84)","v":""},{"$f":"IF('BİLGİ GİRİŞİ'!E84=\"\",\"\",'BİLGİ GİRİŞİ'!E84)","v":""},null,null,null,null,null,null,null,null,null,null,null,null,null,{"$f":"IF('BİLGİ GİRİŞİ'!W84=\"\",\"\",'BİLGİ GİRİŞİ'!W84)","v":""},null,null,null,{"$f":"IF('BİLGİ GİRİŞİ'!T84=\"\",\"\",'BİLGİ GİRİŞİ'!T84)","v":""},null,null,null,{"$f":"IF('BİLGİ GİRİŞİ'!AB84=\"\",\"\",'BİLGİ GİRİŞİ'!AB84)","v":""},null,null,{"$f":"IF('BİLGİ GİRİŞİ'!AF84=\"\",\"\",'BİLGİ GİRİŞİ'!AF84)","v":""},null,null,{"$f":"IF('BİLGİ GİRİŞİ'!AJ84=\"\",\"\",'BİLGİ GİRİŞİ'!AJ84)","v":""},null,null,{"$f":"IF('BİLGİ GİRİŞİ'!AN84=\"\",\"\",'BİLGİ GİRİŞİ'!AN84)","v":""},null,null,{"$f":"IF('BİLGİ GİRİŞİ'!AR84=\"\",\"\",'BİLGİ GİRİŞİ'!AR84)","v":""},null,null,{"$f":"IF('BİLGİ GİRİŞİ'!AV84=\"\",\"\",'BİLGİ GİRİŞİ'!AV84)","v":""},null,null,"",null,null,""]
[{"$f":"IF('BİLGİ GİRİŞİ'!D85=\"\",\"\",'BİLGİ GİRİŞİ'!D85)","v":""},{"$f":"IF('BİLGİ GİRİŞİ'!E85=\"\",\"\",'BİLGİ GİRİŞİ'!E85)","v":""},null,null,null,null,null,null,null,null,null,null,null,null,null,{"$f":"IF('BİLGİ GİRİŞİ'!W85=\"\",\"\",'BİLGİ GİRİŞİ'!W85)","v":""},null,null,null,{"$f":"IF('BİLGİ GİRİŞİ'!T85=\"\",\"\",'BİLGİ GİRİŞİ'!T85)","v":""},null,null,null,{"$f":"IF('BİLGİ GİRİŞİ'!AB85=\"\",\"\",'BİLGİ GİRİŞİ'!AB85)","v":""},null,null,{"$f":"IF('BİLGİ GİRİŞİ'!AF85=\"\",\"\",'BİLGİ GİRİŞİ'!AF85)","v":""},null,null,{"$f":"IF('BİLGİ GİRİŞİ'!AJ85=\"\",\"\",'BİLGİ GİRİŞİ'!AJ85)","v":""},null,null,{"$f":"IF('BİLGİ GİRİŞİ'!AN85=\"\",\"\",'BİLGİ GİRİŞİ'!AN85)","v":""},null,null,{"$f":"IF('BİLGİ GİRİŞİ'!AR85=\"\",\"\",'BİLGİ GİRİŞİ'!AR85)","v":""},null,null,{"$f":"IF('BİLGİ GİRİŞİ'!AV85=\"\",\"\",'BİLGİ GİRİŞİ'!AV85)","v":""},null,null,"",null,null,""]
[{"$f":"IF('BİLGİ GİRİŞİ'!D86=\"\",\"\",'BİLGİ GİRİŞİ'!D86)","v":""},{"$f":"IF('BİLGİ GİRİŞİ'!E86=\"\",\"\",'BİLGİ GİRİŞİ'!E86)","v":""},null,null,null,null,null,null,null,null,null,null,null,null,null,{"$f":"IF('BİLGİ GİRİŞİ'!W86=\"\",\"\",'BİLGİ GİRİŞİ'!W86)","v":""},null,null,null,{"$f":"IF('BİLGİ GİRİŞİ'!T86=\"\",\"\",'BİLGİ GİRİŞİ'!T86)","v":""},null,null,null,{"$f":"IF('BİLGİ GİRİŞİ'!AB86=\"\",\"\",'BİLGİ GİRİŞİ'!AB86)","v":""},null,null,{"$f":"IF('BİLGİ GİRİŞİ'!AF86=\"\",\"\",'BİLGİ GİRİŞİ'!AF86)","v":""},null,null,{"$f":"IF('BİLGİ GİRİŞİ'!AJ86=\"\",\"\",'BİLGİ GİRİŞİ'!AJ86)","v":""},null,null,{"$f":"IF('BİLGİ GİRİŞİ'!AN86=\"\",\"\",'BİLGİ GİRİŞİ'!AN86)","v":""},null,null,{"$f":"IF('BİLGİ GİRİŞİ'!AR86=\"\",\"\",'BİLGİ GİRİŞİ'!AR86)","v":""},null,null,{"$f":"IF('BİLGİ GİRİŞİ'!AV86=\"\",\"\",'BİLGİ GİRİŞİ'!AV86)","v":""},null,null,"",null,null,""]
[{"$f":"IF('BİLGİ GİRİŞİ'!D87=\"\",\"\",'BİLGİ GİRİŞİ'!D87)","v":""},{"$f":"IF('BİLGİ GİRİŞİ'!E87=\"\",\"\",'BİLGİ GİRİŞİ'!E87)","v":""},null,null,null,null,null,null,null,null,null,null,null,null,null,{"$f":"IF('BİLGİ GİRİŞİ'!W87=\"\",\"\",'BİLGİ GİRİŞİ'!W87)","v":""},null,null,null,{"$f":"IF('BİLGİ GİRİŞİ'!T87=\"\",\"\",'BİLGİ GİRİŞİ'!T87)","v":""},null,null,null,{"$f":"IF('BİLGİ GİRİŞİ'!AB87=\"\",\"\",'BİLGİ GİRİŞİ'!AB87)","v":""},null,null,{"$f":"IF('BİLGİ GİRİŞİ'!AF87=\"\",\"\",'BİLGİ GİRİŞİ'!AF87)","v":""},null,null,{"$f":"IF('BİLGİ GİRİŞİ'!AJ87=\"\",\"\",'BİLGİ GİRİŞİ'!AJ87)","v":""},null,null,{"$f":"IF('BİLGİ GİRİŞİ'!AN87=\"\",\"\",'BİLGİ GİRİŞİ'!AN87)","v":""},null,null,{"$f":"IF('BİLGİ GİRİŞİ'!AR87=\"\",\"\",'BİLGİ GİRİŞİ'!AR87)","v":""},null,null,{"$f":"IF('BİLGİ GİRİŞİ'!AV87=\"\",\"\",'BİLGİ GİRİŞİ'!AV87)","v":""},null,null,"",null,null,""]
[{"$f":"IF('BİLGİ GİRİŞİ'!D88=\"\",\"\",'BİLGİ GİRİŞİ'!D88)","v":""},{"$f":"IF('BİLGİ GİRİŞİ'!E88=\"\",\"\",'BİLGİ GİRİŞİ'!E88)","v":""},null,null,null,null,null,null,null,null,null,null,null,null,null,{"$f":"IF('BİLGİ GİRİŞİ'!W88=\"\",\"\",'BİLGİ GİRİŞİ'!W88)","v":""},null,null,null,{"$f":"IF('BİLGİ GİRİŞİ'!T88=\"\",\"\",'BİLGİ GİRİŞİ'!T88)","v":""},null,null,null,{"$f":"IF('BİLGİ GİRİŞİ'!AB88=\"\",\"\",'BİLGİ GİRİŞİ'!AB88)","v":""},null,null,{"$f":"IF('BİLGİ GİRİŞİ'!AF88=\"\",\"\",'BİLGİ GİRİŞİ'!AF88)","v":""},null,null,{"$f":"IF('BİLGİ GİRİŞİ'!AJ88=\"\",\"\",'BİLGİ GİRİŞİ'!AJ88)","v":""},null,null,{"$f":"IF('BİLGİ GİRİŞİ'!AN88=\"\",\"\",'BİLGİ GİRİŞİ'!AN88)","v":""},null,null,{"$f":"IF('BİLGİ GİRİŞİ'!AR88=\"\",\"\",'BİLGİ GİRİŞİ'!AR88)","v":""},null,null,{"$f":"IF('BİLGİ GİRİŞİ'!AV88=\"\",\"\",'BİLGİ GİRİŞİ'!AV88)","v":""},null,null,"",null,null,""]
[{"$f":"IF('BİLGİ GİRİŞİ'!D89=\"\",\"\",'BİLGİ GİRİŞİ'!D89)","v":""},{"$f":"IF('BİLGİ GİRİŞİ'!E89=\"\",\"\",'BİLGİ GİRİŞİ'!E89)","v":""},null,null,null,null,null,null,null,null,null,null,null,null,null,{"$f":"IF('BİLGİ GİRİŞİ'!W89=\"\",\"\",'BİLGİ GİRİŞİ'!W89)","v":""},null,null,null,{"$f":"IF('BİLGİ GİRİŞİ'!T89=\"\",\"\",'BİLGİ GİRİŞİ'!T89)","v":""},null,null,null,{"$f":"IF('BİLGİ GİRİŞİ'!AB89=\"\",\"\",'BİLGİ GİRİŞİ'!AB89)","v":""},null,null,{"$f":"IF('BİLGİ GİRİŞİ'!AF89=\"\",\"\",'BİLGİ GİRİŞİ'!AF89)","v":""},null,null,{"$f":"IF('BİLGİ GİRİŞİ'!AJ89=\"\",\"\",'BİLGİ GİRİŞİ'!AJ89)","v":""},null,null,{"$f":"IF('BİLGİ GİRİŞİ'!AN89=\"\",\"\",'BİLGİ GİRİŞİ'!AN89)","v":""},null,null,{"$f":"IF('BİLGİ GİRİŞİ'!AR89=\"\",\"\",'BİLGİ GİRİŞİ'!AR89)","v":""},null,null,{"$f":"IF('BİLGİ GİRİŞİ'!AV89=\"\",\"\",'BİLGİ GİRİŞİ'!AV89)","v":""},null,null,"",null,null,""]
["TOPLAM (KDV Hariç)",null,null,null,null,null,null,null,null,null,null,null,null,null,null,null,null,null,null,null,null,null,null,{"$f":"SUM(X16:X75)","v":9000},null,null,{"$f":"SUM(AA16:AA75)","v":18000},null,null,{"$f":"SUM(AD16:AD75)","v":12000},null,null,{"$f":"SUM(AG16:AG75)","v":24000},null,null,{"$f":"SUM(AJ16:AJ75)","v":15000},null,null,{"$f":"SUM(AM16:AM75)","v":30000},null,null,{"$f":"SUM(AP16:AP75)","v":12000},null,null,{"$f":"SUM(AS16:AS75)","v":24000}]
[]
["        Piyasa araştırması sonucu yaklaşık  maliyet, KDV hariç",null,null,null,null,null,null,null,null,null,null,null,null,null,null,null,null,null,{"$f":"IF(AS76=\"\",\"\",AS76)","v":24000},null,null,null,null,null,"Türk Lirası olarak hesaplanmış olup iş bu cetvel tarafımızca imza altına alınmıştır."]
[]
[]
[null,{"$f":"IF(B84=\"\",\"\",IF('BİLGİ GİRİŞİ'!AB16=\"\",\"\",'BİLGİ GİRİŞİ'!AB16))","v":"Piyasa Araştırma Görevlisi"},null,null,null,null,null,null,null,null,null,null,{"$f":"IF(M84=\"\",\"\",IF('BİLGİ GİRİŞİ'!AH16=\"\",\"\",'BİLGİ GİRİŞİ'!AH16))","v":"Piyasa Araştırma Görevlisi"},null,null,null,null,null,null,null,null,null,null,{"$f":"IF(X84=\"\",\"\",IF('BİLGİ GİRİŞİ'!AN16=\"\",\"\",'BİLGİ GİRİŞİ'!AN16))","v":""},null,null,null,null,null,null,null,null,null,null,{"$f":"IF(AI84=\"\",\"\",IF('BİLGİ GİRİŞİ'!AT16=\"\",\"\",'BİLGİ GİRİŞİ'!AT16))","v":"OLUR/UYGUNDUR"}]
[null,null,null,null,null,null,null,null,null,null,null,null,null,null,null,null,null,null,null,null,null,null,null,null,null,null,null,null,null,null,null,null,null,null,{"$f":"IF(AI84=\"\",\"\",IF('BİLGİ GİRİŞİ'!O17=\"\",\"….../….../….…..\",'BİLGİ GİRİŞİ'!O17))","v":"2023-03-07"}]
[]
[null,{"$f":"IF('BİLGİ GİRİŞİ'!AB17=\"\",\"\",'BİLGİ GİRİŞİ'!AB17)","v":"Ahmet DEMİR"},null,null,null,null,null,null,null,null,null,null,{"$f":"IF('BİLGİ GİRİŞİ'!AH17=\"\",\"\",'BİLGİ GİRİŞİ'!AH17)","v":"Ayşe YILDIZ"},null,null,null,null,null,null,null,null,null,null,{"$f":"IF('BİLGİ GİRİŞİ'!AN17=\"\",\"\",'BİLGİ GİRİŞİ'!AN17)","v":""},null,null,null,null,null,null,null,null,null,null,{"$f":"IF('BİLGİ GİRİŞİ'!AT17=\"\",\"\",'BİLGİ GİRİŞİ'!AT17)","v":"Mustafa AYDIN"}]
[null,{"$f":"IF(B84=\"\",\"\",IF('BİLGİ GİRİŞİ'!AB18=\"\",\"\",'BİLGİ GİRİŞİ'!AB18))","v":"Müdür Yardımcısı 1"},null,null,null,null,null,null,null,null,null,null,{"$f":"IF(M84=\"\",\"\",IF('BİLGİ GİRİŞİ'!AH18=\"\",\"\",'BİLGİ GİRİŞİ'!AH18))","v":"Öğretmen 1"},null,null,null,null,null,null,null,null,null,null,{"$f":"IF(X84=\"\",\"\",IF('BİLGİ GİRİŞİ'!AN18=\"\",\"\",'BİLGİ GİRİŞİ'!AN18))","v":""},null,null,null,null,null,null,null,null,null,null,{"$f":"IF(AI84=\"\",\"\",IF('BİLGİ GİRİŞİ'!AT18=\"\",\"\",'BİLGİ GİRİŞİ'!AT18))","v":"Okul Müdürü"}]

{"sheet":"4","index":5,"n_rows":38,"n_cols":17,"rows_kept":38,"cut":false,"hidden":false,"merged":[[21,0,21,30],[34,0,34,14],[27,15,27,30],[28,15,28,30],[30,0,30,14],[32,0,32,14],[32,15,32,30],[33,0,33,14],[33,15,33,30],[10,0,10,14],[10,15,10,30],[11,0,11,14],[11,15,11,30],[13,0,13,14],[13,15,13,30],[12,0,12,30],[5,0,5,30],[7,0,7,30],[9,0,9,14],[9,15,9,30],[8,0,8,14],[8,15,8,30],[6,0,6,30],[1,0,2,30],[3,0,3,10],[3,11,3,30],[4,0,4,10],[4,11,4,14],[4,16,4,30],[14,0,14,14],[14,15,14,30],[23,0,23,30],[24,0,27,14],[28,0,28,14],[15,0,15,14],[15,15,15,30],[16,0,16,14],[16,15,16,30],[18,0,18,14],[18,15,18,30],[19,0,19,14],[19,15,19,30],[22,0,22,30],[17,0,17,14],[17,15,17,30]]}
[]
["DOĞRUDAN TEMİN ONAY BELGESİ"]
[]
["ALIMI YAPAN İDARENİN ADI",null,null,null,null,null,null,null,null,null,null,{"$f":"IF('BİLGİ GİRİŞİ'!O8=\"\",\"\",'BİLGİ GİRİŞİ'!O8)","v":"Atatürk İlkokulu Müdürlüğü"}]
["BELGE TARİH VE SAYISI",null,null,null,null,null,null,null,null,null,null,{"$f":"IF('BİLGİ GİRİŞİ'!O18=\"\",\"…../…../……..\",'BİLGİ GİRİŞİ'!O18)","v":"2023-03-06"},null,null,null,"/",{"$f":"IF('BİLGİ GİRİŞİ'!S15=\"\",\"….......................................\",'BİLGİ GİRİŞİ'!S15)","v":456789123}]
[{"$f":"UPPER(IF('BİLGİ GİRİŞİ'!O8=\"\",\"\",'BİLGİ GİRİŞİ'!O8))","v":"ATATÜRK İLKOKULU MÜDÜRLÜĞÜ"}]
["HARCAMA YETKİLİSİ MAKAMINA"]
["DOĞRUDAN TEMİN İLE İLGİLİ BİLGİLER"]
["DOĞRUDAN TEMİN NUMARASI",null,null,null,null,null,null,null,null,null,null,null,null,null,null,{"$f":"IF('BİLGİ GİRİŞİ'!O11=\"\",\"\",'BİLGİ GİRİŞİ'!O11)","v":"22DT1211930"}]
["İŞİN ADI",null,null,null,null,null,null,null,null,null,null,null,null,null,null,{"$f":"IF('BİLGİ GİRİŞİ'!O9=\"\",\"\",'BİLGİ GİRİŞİ'!O9)","v":"Bilişim Malzemeleri Alımı"}]
["TEMİN ŞEKLİ",null,null,null,null,null,null,null,null,null,null,null,null,null,null,{"$f":"IF('BİLGİ GİRİŞİ'!O10=\"\",\"\",'BİLGİ GİRİŞİ'!O10)","v":"22/d"}]
["İŞİN TÜRÜ",null,null,null,null,null,null,null,null,null,null,null,null,null,null,"Mal Alımı/Hizmet Alımı/Yapım İşi"]
[]
["KULLANILABİLİR ÖDENEK TUTARI",null,null,null,null,null,null,null,null,null,null,null,null,null,null,{"$f":"IF('BİLGİ GİRİŞİ'!AJ13=\"\",\"\",'BİLGİ GİRİŞİ'!AJ13)","v":45000}]
["YAKLAŞIK MALİYET",null,null,null,null,null,null,null,null,null,null,null,null,null,null,{"$f":"IF('3'!AS76=\"\",\"\",'3'!AS76)","v":24000}]
["YATIRIM/PROJE NUMARASI (Varsa)"]
["BÜTÇE TERTİBİ (Varsa)",null,null,null,null,null,null,null,null,null,null,null,null,null,null,{"$f":"IF('BİLGİ GİRİŞİ'!AJ12=\"\",\"\",'BİLGİ GİRİŞİ'!AJ12)","v":"6.98.255.9436.13.67.01.03.05.30.02"}]
["FİYAT FARKI VERİLECEKSE ŞARTLARI",null,null,null,null,null,null,null,null,null,null,null,null,null,null,"Verilmeyecektir."]
["AVANS VERİLECEKSE ŞARTLARI",null,null,null,null,null,null,null,null,null,null,null,null,null,null,"Verilmeyecektir."]
["DOKÜMAN HAZIRLANIP HAZIRLANMAYACAĞI",null,null,null,null,null,null,null,null,null,null,null,null,null,null,"Hazırlanmayacaktır."]
[]
[" DOĞRUDAN TEMİN İLE İLGİLİ DİĞER AÇIKLAMALAR"]
["…............"]
["ONAY"]
[{"$f":"CONCATENATE(\"       \",\"Yukarıda belirtilen  işin  Kamu İhale Kanunu'nun  \",IF('BİLGİ GİRİŞİ'!O10=\"\",\".............................................................................\",'BİLGİ GİRİŞİ'!O10),\" maddesine göre Doğrudan Temin yoluyla satın alınması hususunu;\")","v":"       Yukarıda belirtilen  işin  Kamu İhale Kanunu'nun  22/d maddesine göre Doğrudan Temin yoluyla satın alınması hususunu;"}]
[]
[]
[null,null,null,null,null,null,null,null,null,null,null,null,null,null,null,{"$f":"IF(P33=\"\",\"\",IF('BİLGİ GİRİŞİ'!AT16=\"\",\"\",'BİLGİ GİRİŞİ'!AT16))","v":"OLUR/UYGUNDUR"}]
["    Olurlarınıza arz ederim.",null,null,null,null,null,null,null,null,null,null,null,null,null,null,{"$f":"IF(P33=\"\",\"\",IF('BİLGİ GİRİŞİ'!O18=\"\",\"…../…../……..\",'BİLGİ GİRİŞİ'!O18))","v":"2023-03-06"}]
[]
[{"$f":"IF(A34=\"\",\"\",IF('BİLGİ GİRİŞİ'!O18=\"\",\"…../…../……..\",'BİLGİ GİRİŞİ'!O18))","v":"2023-03-06"}]
[]
[null,null,null,null,null,null,null,null,null,null,null,null,null,null,null,{"$f":"IF('BİLGİ GİRİŞİ'!AT17=\"\",\"\",'BİLGİ GİRİŞİ'!AT17)","v":"Mustafa AYDIN"}]
[{"$f":"IF('BİLGİ GİRİŞİ'!AB17=\"\",\"\",'BİLGİ GİRİŞİ'!AB17)","v":"Ahmet DEMİR"},null,null,null,null,null,null,null,null,null,null,null,null,null,null,{"$f":"IF(P33=\"\",\"\",IF('BİLGİ GİRİŞİ'!AT18=\"\",\"\",'BİLGİ GİRİŞİ'!AT18))","v":"Okul Müdürü"}]
[{"$f":"IF(A34=\"\",\"\",IF('BİLGİ GİRİŞİ'!AB18=\"\",\"\",'BİLGİ GİRİŞİ'!AB18))","v":"Müdür Yardımcısı 1"}]
[]
[]
["Ek:İdare Tarafından Hazırlanan Yaklaşık Maliyet Hesap Cetveli"]

{"sheet":"5","index":6,"n_rows":94,"n_cols":28,"rows_kept":94,"cut":false,"hidden":false,"merged":[[88,1,88,14],[88,15,88,18],[88,19,88,22],[88,23,88,26],[88,27,88,30],[89,1,89,14],[89,15,89,18],[89,19,89,22],[89,23,89,26],[89,27,89,30],[86,1,86,14],[86,15,86,18],[86,19,86,22],[86,23,86,26],[86,27,86,30],[87,1,87,14],[87,15,87,18],[87,19,87,22],[87,23,87,26],[87,27,87,30],[84,1,84,14],[84,15,84,18],[84,19,84,22],[84,23,84,26],[84,27,84,30],[85,1,85,14],[85,15,85,18],[85,19,85,22],[85,23,85,26],[85,27,85,30],[82,1,82,14],[82,15,82,18],[82,19,82,22],[82,23,82,26],[82,27,82,30],[83,1,83,14],[83,15,83,18],[83,19,83,22],[83,23,83,26],[83,27,83,30],[80,1,80,14],[80,15,80,18],[80,19,80,22],[80,23,80,26],[80,27,80,30],[81,1,81,14],[81,15,81,18],[81,19,81,22],[81,23,81,26],[81,27,81,30],[78,1,78,14],[78,15,78,18],[78,19,78,22],[78,23,78,26],[78,27,78,30],[79,1,79,14],[79,15,79,18],[79,19,79,22],[79,23,79,26],[79,27,79,30],[76,1,76,14],[76,15,76,18],[76,19,76,22],[76,23,76,26],[76,27,76,30],[77,1,77,14],[77,15,77,18],[77,19,77,22],[77,23,77,26],[77,27,77,30],[74,1,74,14],[74,15,74,18],[74,19,74,22],[74,23,74,26],[74,27,74,30],[75,1,75,14],[75,15,75,18],[75,19,75,22],[75,23,75,26],[75,27,75,30],[72,1,72,14],[72,15,72,18],[72,19,72,22],[72,23,72,26],[72,27,72,30],[73,1,73,14],[73,15,73,18],[73,19,73,22],[73,23,73,26],[73,27,73,30],[70,1,70,14],[70,15,70,18],[70,19,70,22],[70,23,70,26],[70,27,70,30],[71,1,71,14],[71,15,71,18],[71,19,71,22],[71,23,71,26],[71,27,71,30],[93,20,93,30],[90,1,90,14],[90,15,90,18],[90,19,90,22],[90,23,90,26],[90,27,90,30],[45,23,45,26],[45,27,45,30],[46,1,46,14],[46,15,46,18],[46,19,46,22],[46,23,46,26],[46,27,46,30],[45,1,45,14],[45,15,45,18],[45,19,45,22],[47,23,47,26],[47,27,47,30],[48,1,48,14],[48,15,48,18],[48,19,48,22],[48,23,48,26],[48,27,48,30],[91,0,91,22],[91,23,91,26],[91,27,91,30],[43,1,43,14],[43,15,43,18],[43,19,43,22],[43,23,43,26],[43,27,43,30],[44,1,44,14],[44,15,44,18],[44,19,44,22],[44,23,44,26],[44,27,44,30],[49,1,49,14],[49,15,49,18],[49,19,49,22],[49,23,49,26],[49,27,49,30],[47,1,47,14],[47,15,47,18],[47,19,47,22],[50,1,50,14],[51,1,51,14],[52,1,52,14],[53,1,53,14],[41,1,41,14],[41,15,41,18],[41,19,41,22],[41,23,41,26],[41,27,41,30],[42,1,42,14],[42,15,42,18],[42,19,42,22],[42,23,42,26],[42,27,42,30],[39,1,39,14],[39,15,39,18],[39,19,39,22],[39,23,39,26],[39,27,39,30],[40,1,40,14],[40,15,40,18],[40,19,40,22],[40,23,40,26],[40,27,40,30],[37,1,37,14],[37,15,37,18],[37,19,37,22],[37,23,37,26],[37,27,37,30],[38,1,38,14],[38,15,38,18],[38,19,38,22],[38,23,38,26],[38,27,38,30],[35,1,35,14],[35,15,35,18],[35,19,35,22],[35,23,35,26],[35,27,35,30],[36,1,36,14],[36,15,36,18],[36,19,36,22],[36,23,36,26],[36,27,36,30],[25,0,26,30],[27,0,27,30],[33,1,33,14],[33,19,33,22],[33,15,33,18],[33,23,33,26],[33,27,33,30],[34,1,34,14],[34,15,34,18],[34,19,34,22],[34,23,34,26],[34,27,34,30],[31,1,31,14],[31,19,31,22],[31,15,31,18],[31,23,31,26],[31,27,31,30],[32,1,32,14],[32,19,32,22],[32,15,32,18],[32,23,32,26],[32,27,32,30],[15,0,15,30],[18,0,18,9],[19,0,19,9],[18,20,18,30],[19,20,19,30],[18,10,18,19],[19,10,19,19],[20,10,20,19],[20,20,20,30],[20,0,20,9],[57,1,57,14],[58,1,58,14],[59,1,59,14],[60,1,60,14],[61,1,61,14],[62,1,62,14],[1,0,1,30],[2,0,2,30],[3,0,3,30],[5,0,5,2],[5,4,5,22],[5,25,5,30],[23,0,23,30],[29,0,29,30],[30,1,30,14],[30,15,30,18],[30,19,30,22],[30,23,30,26],[30,27,30,30],[6,0,6,2],[6,4,6,26],[8,0,8,30],[10,0,11,30],[12,0,14,30],[63,1,63,14],[64,1,64,14],[65,1,65,14],[66,1,66,14],[67,1,67,14],[68,1,68,14],[69,1,69,14],[50,15,50,18],[50,19,50,22],[53,15,53,18],[53,19,53,22],[56,15,56,18],[56,19,56,22],[59,15,59,18],[59,19,59,22],[62,15,62,18],[62,19,62,22],[65,15,65,18],[65,19,65,22],[68,15,68,18],[68,19,68,22],[54,1,54,14],[55,1,55,14],[56,1,56,14],[50,23,50,26],[50,27,50,30],[51,15,51,18],[51,19,51,22],[51,23,51,26],[51,27,51,30],[52,15,52,18],[52,19,52,22],[52,23,52,26],[52,27,52,30],[53,23,53,26],[53,27,53,30],[54,15,54,18],[54,19,54,22],[54,23,54,26],[54,27,54,30],[55,15,55,18],[55,19,55,22],[55,23,55,26],[55,27,55,30],[56,23,56,26],[56,27,56,30],[57,15,57,18],[57,19,57,22],[57,23,57,26],[57,27,57,30],[58,15,58,18],[58,19,58,22],[58,23,58,26],[58,27,58,30],[59,23,59,26],[59,27,59,30],[60,15,60,18],[60,19,60,22],[60,23,60,26],[60,27,60,30],[61,15,61,18],[61,19,61,22],[61,23,61,26],[61,27,61,30],[62,23,62,26],[62,27,62,30],[63,15,63,18],[63,19,63,22],[63,23,63,26],[63,27,63,30],[64,15,64,18],[64,19,64,22],[64,23,64,26],[64,27,64,30],[68,23,68,26],[68,27,68,30],[69,15,69,18],[69,19,69,22],[69,23,69,26],[69,27,69,30],[65,23,65,26],[65,27,65,30],[66,15,66,18],[66,19,66,22],[66,23,66,26],[66,27,66,30],[67,15,67,18],[67,19,67,22],[67,23,67,26],[67,27,67,30]]}
[]
["T.C."]
[{"$f":"IF('BİLGİ GİRİŞİ'!O7=\"\",\"\",'BİLGİ GİRİŞİ'!O7)","v":"BULANIK KAYMAKAMLIĞI"}]
[{"$f":"IF('BİLGİ GİRİŞİ'!O8=\"\",\"\",'BİLGİ GİRİŞİ'!O8)","v":"Atatürk İlkokulu Müdürlüğü"}]
[]
["Sayı",null,null,":",{"$f":"IF('BİLGİ GİRİŞİ'!S15=\"\",\"\",'BİLGİ GİRİŞİ'!S15)","v":456789123},null,null,null,null,null,null,null,null,null,null,null,null,null,null,null,null,null,null,null,null,{"$f":"IF('BİLGİ GİRİŞİ'!O19=\"\",\"…../…../……..\",'BİLGİ GİRİŞİ'!O19)","v":"2023-03-06"}]
["Konu",null,null,":","Teklif Vermeye Davet"]
[]
["İLGİLİ GERÇEK/TÜZEL KİŞİLERE"]
[]
[{"$f":"CONCATENATE(\"       \",\"Kurumumuz ihtiyaçlarında kullanılmak üzere aşağıda bilgileri verilen Mal/Hizmet/Yapım İşi,  Kamu İhale Kanunu'nun \",IF('BİLGİ GİRİŞİ'!O10=\"\",\".............................................................................\",'BİLGİ GİRİŞİ'!O10),\" maddesine göre Doğrudan Temin yoluyla satın alınacaktır.\")","v":"       Kurumumuz ihtiyaçlarında kullanılmak üzere aşağıda bilgileri verilen Mal/Hizmet/Yapım İşi,  Kamu İhale Kanunu'nun 22/d maddesine göre Doğrudan Temin yoluyla satın alınacaktır."}]
[]
[{"$f":"CONCATENATE(\"        İlgilenmeniz halinde aşağıda bilgileri verilen Mal/Hizmet/Yapım İşi'ne ilişkin, KDV hariç teklifinizi içeren birim fiyat ve toplam fiyatlarının karşılarına yazılarak \",  TEXT(IF('BİLGİ GİRİŞİ'!O20=\"\",\"…../…../……..\",'BİLGİ GİRİŞİ'!O20),\"gg.aa.yyyy \"),   \" tarihi mesai bitimine kadar Kurumumuza gönderilmesi hususunda;\")","v":"        İlgilenmeniz halinde aşağıda bilgileri verilen Mal/Hizmet/Yapım İşi'ne ilişkin, KDV hariç teklifinizi içeren birim fiyat ve toplam fiyatlarının karşılarına yazılarak 08.03.2023  tarihi mesai bitimine kadar Kurumumuza gönderilmesi hususunda;"}]
[]
[]
["        Gereğini rica ederim/ederiz."]
[]
[]
[{"$f":"IF(A20=\"\",\"\",IF('BİLGİ GİRİŞİ'!AH16=\"\",\"\",'BİLGİ GİRİŞİ'!AH16))","v":"Piyasa Araştırma Görevlisi"},null,null,null,null,null,null,null,null,null,{"$f":"IF(K20=\"\",\"\",IF('BİLGİ GİRİŞİ'!AN16=\"\",\"\",'BİLGİ GİRİŞİ'!AN16))","v":""},null,null,null,null,null,null,null,null,null,{"$f":"IF(U20=\"\",\"\",IF('BİLGİ GİRİŞİ'!AB16=\"\",\"\",'BİLGİ GİRİŞİ'!AB16))","v":"Piyasa Araştırma Görevlisi"}]
[{"$f":"IF('BİLGİ GİRİŞİ'!AH17=\"\",\"\",'BİLGİ GİRİŞİ'!AH17)","v":"Ayşe YILDIZ"},null,null,null,null,null,null,null,null,null,{"$f":"IF('BİLGİ GİRİŞİ'!AN17=\"\",\"\",'BİLGİ GİRİŞİ'!AN17)","v":""},null,null,null,null,null,null,null,null,null,{"$f":"IF('BİLGİ GİRİŞİ'!AB17=\"\",\"\",'BİLGİ GİRİŞİ'!AB17)","v":"Ahmet DEMİR"}]
[{"$f":"IF('BİLGİ GİRİŞİ'!AH18=\"\",\"\",'BİLGİ GİRİŞİ'!AH18)","v":"Öğretmen 1"},null,null,null,null,null,null,null,null,null,{"$f":"IF(K20=\"\",\"\",IF('BİLGİ GİRİŞİ'!AN18=\"\",\"\",'BİLGİ GİRİŞİ'!AN18))","v":""},null,null,null,null,null,null,null,null,null,{"$f":"IF('BİLGİ GİRİŞİ'!AB18=\"\",\"\",'BİLGİ GİRİŞİ'!AB18)","v":"Müdür Yardımcısı 1"}]
[]
[]
[{"$f":"IF('BİLGİ GİRİŞİ'!O8=\"\",\"\",CONCATENATE(UPPER('BİLGİ GİRİŞİ'!O8),\"\",UPPER(IF('BİLGİ GİRİŞİ'!O8=\"\",\"\",'BİLGİ GİRİŞİ'!AN8))))","v":"ATATÜRK İLKOKULU MÜDÜRLÜĞÜNE"}]
[]
["          Kurumunuzca satın alınacak Mal/Hizmet/Yapım İşi'ne ilişkin teklifimizi içeren birim fiyatlar ve toplam fiyatlar aşağıya çıkarılmıştır."]
[]
["         Gereğini arz ederim/ederiz."]
[]
["MAL'IN/HİZMET'İN/YAPIM İŞİ'NİN"]
["S","Kalem/KısımBilgileri",null,null,null,null,null,null,null,null,null,null,null,null,null,"Birimi",null,null,null,"Miktarı",null,null,null,"Birim Fiyatı",null,null,null,"Toplam Fiyatı"]
[{"$f":"IF('BİLGİ GİRİŞİ'!D30=\"\",\"\",'BİLGİ GİRİŞİ'!D30)","v":1},{"$f":"IF('BİLGİ GİRİŞİ'!E30=\"\",\"\",'BİLGİ GİRİŞİ'!E30)","v":"AIO (All In One) Masaüstü Bilgisayar "},null,null,null,null,null,null,null,null,null,null,null,null,null,{"$f":"IF('BİLGİ GİRİŞİ'!W30=\"\",\"\",'BİLGİ GİRİŞİ'!W30)","v":"Adet"},null,null,null,{"$f":"IF('BİLGİ GİRİŞİ'!T30=\"\",\"\",IF('BİLGİ GİRİŞİ'!$BO$28=1,\"1\",'BİLGİ GİRİŞİ'!T30))","v":"1"}]
[{"$f":"IF('BİLGİ GİRİŞİ'!D31=\"\",\"\",'BİLGİ GİRİŞİ'!D31)","v":2},{"$f":"IF('BİLGİ GİRİŞİ'!E31=\"\",\"\",'BİLGİ GİRİŞİ'!E31)","v":"Fotokopi Makinesi"},null,null,null,null,null,null,null,null,null,null,null,null,null,{"$f":"IF('BİLGİ GİRİŞİ'!W31=\"\",\"\",'BİLGİ GİRİŞİ'!W31)","v":"Adet"},null,null,null,{"$f":"IF('BİLGİ GİRİŞİ'!T31=\"\",\"\",IF('BİLGİ GİRİŞİ'!$BO$28=1,\"1\",'BİLGİ GİRİŞİ'!T31))","v":"1"}]
[{"$f":"IF('BİLGİ GİRİŞİ'!D32=\"\",\"\",'BİLGİ GİRİŞİ'!D32)","v":3},{"$f":"IF('BİLGİ GİRİŞİ'!E32=\"\",\"\",'BİLGİ GİRİŞİ'!E32)","v":"Projektör"},null,null,null,null,null,null,null,null,null,null,null,null,null,{"$f":"IF('BİLGİ GİRİŞİ'!W32=\"\",\"\",'BİLGİ GİRİŞİ'!W32)","v":"Adet"},null,null,null,{"$f":"IF('BİLGİ GİRİŞİ'!T32=\"\",\"\",IF('BİLGİ GİRİŞİ'!$BO$28=1,\"1\",'BİLGİ GİRİŞİ'!T32))","v":"1"}]
[{"$f":"IF('BİLGİ GİRİŞİ'!D33=\"\",\"\",'BİLGİ GİRİŞİ'!D33)","v":""},{"$f":"IF('BİLGİ GİRİŞİ'!E33=\"\",\"\",'BİLGİ GİRİŞİ'!E33)","v":""},null,null,null,null,null,null,null,null,null,null,null,null,null,{"$f":"IF('BİLGİ GİRİŞİ'!W33=\"\",\"\",'BİLGİ GİRİŞİ'!W33)","v":""},null,null,null,{"$f":"IF('BİLGİ GİRİŞİ'!T33=\"\",\"\",IF('BİLGİ GİRİŞİ'!$BO$28=1,\"1\",'BİLGİ GİRİŞİ'!T33))","v":""}]
[{"$f":"IF('BİLGİ GİRİŞİ'!D34=\"\",\"\",'BİLGİ GİRİŞİ'!D34)","v":""},{"$f":"IF('BİLGİ GİRİŞİ'!E34=\"\",\"\",'BİLGİ GİRİŞİ'!E34)","v":""},null,null,null,null,null,null,null,null,null,null,null,null,null,{"$f":"IF('BİLGİ GİRİŞİ'!W34=\"\",\"\",'BİLGİ GİRİŞİ'!W34)","v":""},null,null,null,{"$f":"IF('BİLGİ GİRİŞİ'!T34=\"\",\"\",IF('BİLGİ GİRİŞİ'!$BO$28=1,\"1\",'BİLGİ GİRİŞİ'!T34))","v":""}]
[{"$f":"IF('BİLGİ GİRİŞİ'!D35=\"\",\"\",'BİLGİ GİRİŞİ'!D35)","v":""},{"$f":"IF('BİLGİ GİRİŞİ'!E35=\"\",\"\",'BİLGİ GİRİŞİ'!E35)","v":""},null,null,null,null,null,null,null,null,null,null,null,null,null,{"$f":"IF('BİLGİ GİRİŞİ'!W35=\"\",\"\",'BİLGİ GİRİŞİ'!W35)","v":""},null,null,null,{"$f":"IF('BİLGİ GİRİŞİ'!T35=\"\",\"\",IF('BİLGİ GİRİŞİ'!$BO$28=1,\"1\",'BİLGİ GİRİŞİ'!T35))","v":""}]
[{"$f":"IF('BİLGİ GİRİŞİ'!D36=\"\",\"\",'BİLGİ GİRİŞİ'!D36)","v":""},{"$f":"IF('BİLGİ GİRİŞİ'!E36=\"\",\"\",'BİLGİ GİRİŞİ'!E36)","v":""},null,null,null,null,null,null,null,null,null,null,null,null,null,{"$f":"IF('BİLGİ GİRİŞİ'!W36=\"\",\"\",'BİLGİ GİRİŞİ'!W36)","v":""},null,null,null,{"$f":"IF('BİLGİ GİRİŞİ'!T36=\"\",\"\",IF('BİLGİ GİRİŞİ'!$BO$28=1,\"1\",'BİLGİ GİRİŞİ'!T36))","v":""}]
[{"$f":"IF('BİLGİ GİRİŞİ'!D37=\"\",\"\",'BİLGİ GİRİŞİ'!D37)","v":""},{"$f":"IF('BİLGİ GİRİŞİ'!E37=\"\",\"\",'BİLGİ GİRİŞİ'!E37)","v":""},null,null,null,null,null,null,null,null,null,null,null,null,null,{"$f":"IF('BİLGİ GİRİŞİ'!W37=\"\",\"\",'BİLGİ GİRİŞİ'!W37)","v":""},null,null,null,{"$f":"IF('BİLGİ GİRİŞİ'!T37=\"\",\"\",IF('BİLGİ GİRİŞİ'!$BO$28=1,\"1\",'BİLGİ GİRİŞİ'!T37))","v":""}]
[{"$f":"IF('BİLGİ GİRİŞİ'!D38=\"\",\"\",'BİLGİ GİRİŞİ'!D38)","v":""},{"$f":"IF('BİLGİ GİRİŞİ'!E38=\"\",\"\",'BİLGİ GİRİŞİ'!E38)","v":""},null,null,null,null,null,null,null,null,null,null,null,null,null,{"$f":"IF('BİLGİ GİRİŞİ'!W38=\"\",\"\",'BİLGİ GİRİŞİ'!W38)","v":""},null,null,null,{"$f":"IF('BİLGİ GİRİŞİ'!T38=\"\",\"\",IF('BİLGİ GİRİŞİ'!$BO$28=1,\"1\",'BİLGİ GİRİŞİ'!T38))","v":""}]
[{"$f":"IF('BİLGİ GİRİŞİ'!D39=\"\",\"\",'BİLGİ GİRİŞİ'!D39)","v":""},{"$f":"IF('BİLGİ GİRİŞİ'!E39=\"\",\"\",'BİLGİ GİRİŞİ'!E39)","v":""},null,null,null,null,null,null,null,null,null,null,null,null,null,{"$f":"IF('BİLGİ GİRİŞİ'!W39=\"\",\"\",'BİLGİ GİRİŞİ'!W39)","v":""},null,null,null,{"$f":"IF('BİLGİ GİRİŞİ'!T39=\"\",\"\",IF('BİLGİ GİRİŞİ'!$BO$28=1,\"1\",'BİLGİ GİRİŞİ'!T39))","v":""}]
[{"$f":"IF('BİLGİ GİRİŞİ'!D40=\"\",\"\",'BİLGİ GİRİŞİ'!D40)","v":""},{"$f":"IF('BİLGİ GİRİŞİ'!E40=\"\",\"\",'BİLGİ GİRİŞİ'!E40)","v":""},null,null,null,null,null,null,null,null,null,null,null,null,null,{"$f":"IF('BİLGİ GİRİŞİ'!W40=\"\",\"\",'BİLGİ GİRİŞİ'!W40)","v":""},null,null,null,{"$f":"IF('BİLGİ GİRİŞİ'!T40=\"\",\"\",IF('BİLGİ GİRİŞİ'!$BO$28=1,\"1\",'BİLGİ GİRİŞİ'!T40))","v":""}]
[{"$f":"IF('BİLGİ GİRİŞİ'!D41=\"\",\"\",'BİLGİ GİRİŞİ'!D41)","v":""},{"$f":"IF('BİLGİ GİRİŞİ'!E41=\"\",\"\",'BİLGİ GİRİŞİ'!E41)","v":""},null,null,null,null,null,null,null,null,null,null,null,null,null,{"$f":"IF('BİLGİ GİRİŞİ'!W41=\"\",\"\",'BİLGİ GİRİŞİ'!W41)","v":""},null,null,null,{"$f":"IF('BİLGİ GİRİŞİ'!T41=\"\",\"\",IF('BİLGİ GİRİŞİ'!$BO$28=1,\"1\",'BİLGİ GİRİŞİ'!T41))","v":""}]
[{"$f":"IF('BİLGİ GİRİŞİ'!D42=\"\",\"\",'BİLGİ GİRİŞİ'!D42)","v":""},{"$f":"IF('BİLGİ GİRİŞİ'!E42=\"\",\"\",'BİLGİ GİRİŞİ'!E42)","v":""},null,null,null,null,null,null,null,null,null,null,null,null,null,{"$f":"IF('BİLGİ GİRİŞİ'!W42=\"\",\"\",'BİLGİ GİRİŞİ'!W42)","v":""},null,null,null,{"$f":"IF('BİLGİ GİRİŞİ'!T42=\"\",\"\",IF('BİLGİ GİRİŞİ'!$BO$28=1,\"1\",'BİLGİ GİRİŞİ'!T42))","v":""}]
[{"$f":"IF('BİLGİ GİRİŞİ'!D43=\"\",\"\",'BİLGİ GİRİŞİ'!D43)","v":""},{"$f":"IF('BİLGİ GİRİŞİ'!E43=\"\",\"\",'BİLGİ GİRİŞİ'!E43)","v":""},null,null,null,null,null,null,null,null,null,null,null,null,null,{"$f":"IF('BİLGİ GİRİŞİ'!W43=\"\",\"\",'BİLGİ GİRİŞİ'!W43)","v":""},null,null,null,{"$f":"IF('BİLGİ GİRİŞİ'!T43=\"\",\"\",IF('BİLGİ GİRİŞİ'!$BO$28=1,\"1\",'BİLGİ GİRİŞİ'!T43))","v":""}]
[{"$f":"IF('BİLGİ GİRİŞİ'!D44=\"\",\"\",'BİLGİ GİRİŞİ'!D44)","v":""},{"$f":"IF('BİLGİ GİRİŞİ'!E44=\"\",\"\",'BİLGİ GİRİŞİ'!E44)","v":""},null,null,null,null,null,null,null,null,null,null,null,null,null,{"$f":"IF('BİLGİ GİRİŞİ'!W44=\"\",\"\",'BİLGİ GİRİŞİ'!W44)","v":""},null,null,null,{"$f":"IF('BİLGİ GİRİŞİ'!T44=\"\",\"\",IF('BİLGİ GİRİŞİ'!$BO$28=1,\"1\",'BİLGİ GİRİŞİ'!T44))","v":""}]
[{"$f":"IF('BİLGİ GİRİŞİ'!D45=\"\",\"\",'BİLGİ GİRİŞİ'!D45)","v":""},{"$f":"IF('BİLGİ GİRİŞİ'!E45=\"\",\"\",'BİLGİ GİRİŞİ'!E45)","v":""},null,null,null,null,null,null,null,null,null,null,null,null,null,{"$f":"IF('BİLGİ GİRİŞİ'!W45=\"\",\"\",'BİLGİ GİRİŞİ'!W45)","v":""},null,null,null,{"$f":"IF('BİLGİ GİRİŞİ'!T45=\"\",\"\",IF('BİLGİ GİRİŞİ'!$BO$28=1,\"1\",'BİLGİ GİRİŞİ'!T45))","v":""}]
[{"$f":"IF('BİLGİ GİRİŞİ'!D46=\"\",\"\",'BİLGİ GİRİŞİ'!D46)","v":""},{"$f":"IF('BİLGİ GİRİŞİ'!E46=\"\",\"\",'BİLGİ GİRİŞİ'!E46)","v":""},null,null,null,null,null,null,null,null,null,null,null,null,null,{"$f":"IF('BİLGİ GİRİŞİ'!W46=\"\",\"\",'BİLGİ GİRİŞİ'!W46)","v":""},null,null,null,{"$f":"IF('BİLGİ GİRİŞİ'!T46=\"\",\"\",IF('BİLGİ GİRİŞİ'!$BO$28=1,\"1\",'BİLGİ GİRİŞİ'!T46))","v":""}]
[{"$f":"IF('BİLGİ GİRİŞİ'!D47=\"\",\"\",'BİLGİ GİRİŞİ'!D47)","v":""},{"$f":"IF('BİLGİ GİRİŞİ'!E47=\"\",\"\",'BİLGİ GİRİŞİ'!E47)","v":""},null,null,null,null,null,null,null,null,null,null,null,null,null,{"$f":"IF('BİLGİ GİRİŞİ'!W47=\"\",\"\",'BİLGİ GİRİŞİ'!W47)","v":""},null,null,null,{"$f":"IF('BİLGİ GİRİŞİ'!T47=\"\",\"\",IF('BİLGİ GİRİŞİ'!$BO$28=1,\"1\",'BİLGİ GİRİŞİ'!T47))","v":""}]
[{"$f":"IF('BİLGİ GİRİŞİ'!D48=\"\",\"\",'BİLGİ GİRİŞİ'!D48)","v":""},{"$f":"IF('BİLGİ GİRİŞİ'!E48=\"\",\"\",'BİLGİ GİRİŞİ'!E48)","v":""},null,null,null,null,null,null,null,null,null,null,null,null,null,{"$f":"IF('BİLGİ GİRİŞİ'!W48=\"\",\"\",'BİLGİ GİRİŞİ'!W48)","v":""},null,null,null,{"$f":"IF('BİLGİ GİRİŞİ'!T48=\"\",\"\",IF('BİLGİ GİRİŞİ'!$BO$28=1,\"1\",'BİLGİ GİRİŞİ'!T48))","v":""}]
[{"$f":"IF('BİLGİ GİRİŞİ'!D49=\"\",\"\",'BİLGİ GİRİŞİ'!D49)","v":""},{"$f":"IF('BİLGİ GİRİŞİ'!E49=\"\",\"\",'BİLGİ GİRİŞİ'!E49)","v":""},null,null,null,null,null,null,null,null,null,null,null,null,null,{"$f":"IF('BİLGİ GİRİŞİ'!W49=\"\",\"\",'BİLGİ GİRİŞİ'!W49)","v":""},null,null,null,{"$f":"IF('BİLGİ GİRİŞİ'!T49=\"\",\"\",IF('BİLGİ GİRİŞİ'!$BO$28=1,\"1\",'BİLGİ GİRİŞİ'!T49))","v":""}]
[{"$f":"IF('BİLGİ GİRİŞİ'!D50=\"\",\"\",'BİLGİ GİRİŞİ'!D50)","v":""},{"$f":"IF('BİLGİ GİRİŞİ'!E50=\"\",\"\",'BİLGİ GİRİŞİ'!E50)","v":""},null,null,null,null,null,null,null,null,null,null,null,null,null,{"$f":"IF('BİLGİ GİRİŞİ'!W50=\"\",\"\",'BİLGİ GİRİŞİ'!W50)","v":""},null,null,null,{"$f":"IF('BİLGİ GİRİŞİ'!T50=\"\",\"\",IF('BİLGİ GİRİŞİ'!$BO$28=1,\"1\",'BİLGİ GİRİŞİ'!T50))","v":""}]
[{"$f":"IF('BİLGİ GİRİŞİ'!D51=\"\",\"\",'BİLGİ GİRİŞİ'!D51)","v":""},{"$f":"IF('BİLGİ GİRİŞİ'!E51=\"\",\"\",'BİLGİ GİRİŞİ'!E51)","v":""},null,null,null,null,null,null,null,null,null,null,null,null,null,{"$f":"IF('BİLGİ GİRİŞİ'!W51=\"\",\"\",'BİLGİ GİRİŞİ'!W51)","v":""},null,null,null,{"$f":"IF('BİLGİ GİRİŞİ'!T51=\"\",\"\",IF('BİLGİ GİRİŞİ'!$BO$28=1,\"1\",'BİLGİ GİRİŞİ'!T51))","v":""}]
[{"$f":"IF('BİLGİ GİRİŞİ'!D52=\"\",\"\",'BİLGİ GİRİŞİ'!D52)","v":""},{"$f":"IF('BİLGİ GİRİŞİ'!E52=\"\",\"\",'BİLGİ GİRİŞİ'!E52)","v":""},null,null,null,null,null,null,null,null,null,null,null,null,null,{"$f":"IF('BİLGİ GİRİŞİ'!W52=\"\",\"\",'BİLGİ GİRİŞİ'!W52)","v":""},null,null,null,{"$f":"IF('BİLGİ GİRİŞİ'!T52=\"\",\"\",IF('BİLGİ GİRİŞİ'!$BO$28=1,\"1\",'BİLGİ GİRİŞİ'!T52))","v":""}]
[{"$f":"IF('BİLGİ GİRİŞİ'!D53=\"\",\"\",'BİLGİ GİRİŞİ'!D53)","v":""},{"$f":"IF('BİLGİ GİRİŞİ'!E53=\"\",\"\",'BİLGİ GİRİŞİ'!E53)","v":""},null,null,null,null,null,null,null,null,null,null,null,null,null,{"$f":"IF('BİLGİ GİRİŞİ'!W53=\"\",\"\",'BİLGİ GİRİŞİ'!W53)","v":""},null,null,null,{"$f":"IF('BİLGİ GİRİŞİ'!T53=\"\",\"\",IF('BİLGİ GİRİŞİ'!$BO$28=1,\"1\",'BİLGİ GİRİŞİ'!T53))","v":""}]
[{"$f":"IF('BİLGİ GİRİŞİ'!D54=\"\",\"\",'BİLGİ GİRİŞİ'!D54)","v":""},{"$f":"IF('BİLGİ GİRİŞİ'!E54=\"\",\"\",'BİLGİ GİRİŞİ'!E54)","v":""},null,null,null,null,null,null,null,null,null,null,null,null,null,{"$f":"IF('BİLGİ GİRİŞİ'!W54=\"\",\"\",'BİLGİ GİRİŞİ'!W54)","v":""},null,null,null,{"$f":"IF('BİLGİ GİRİŞİ'!T54=\"\",\"\",IF('BİLGİ GİRİŞİ'!$BO$28=1,\"1\",'BİLGİ GİRİŞİ'!T54))","v":""}]
[{"$f":"IF('BİLGİ GİRİŞİ'!D55=\"\",\"\",'BİLGİ GİRİŞİ'!D55)","v":""},{"$f":"IF('BİLGİ GİRİŞİ'!E55=\"\",\"\",'BİLGİ GİRİŞİ'!E55)","v":""},null,null,null,null,null,null,null,null,null,null,null,null,null,{"$f":"IF('BİLGİ GİRİŞİ'!W55=\"\",\"\",'BİLGİ GİRİŞİ'!W55)","v":""},null,null,null,{"$f":"IF('BİLGİ GİRİŞİ'!T55=\"\",\"\",IF('BİLGİ GİRİŞİ'!$BO$28=1,\"1\",'BİLGİ GİRİŞİ'!T55))","v":""}]
[{"$f":"IF('BİLGİ GİRİŞİ'!D56=\"\",\"\",'BİLGİ GİRİŞİ'!D56)","v":""},{"$f":"IF('BİLGİ GİRİŞİ'!E56=\"\",\"\",'BİLGİ GİRİŞİ'!E56)","v":""},null,null,null,null,null,null,null,null,null,null,null,null,null,{"$f":"IF('BİLGİ GİRİŞİ'!W56=\"\",\"\",'BİLGİ GİRİŞİ'!W56)","v":""},null,null,null,{"$f":"IF('BİLGİ GİRİŞİ'!T56=\"\",\"\",IF('BİLGİ GİRİŞİ'!$BO$28=1,\"1\",'BİLGİ GİRİŞİ'!T56))","v":""}]
[{"$f":"IF('BİLGİ GİRİŞİ'!D57=\"\",\"\",'BİLGİ GİRİŞİ'!D57)","v":""},{"$f":"IF('BİLGİ GİRİŞİ'!E57=\"\",\"\",'BİLGİ GİRİŞİ'!E57)","v":""},null,null,null,null,null,null,null,null,null,null,null,null,null,{"$f":"IF('BİLGİ GİRİŞİ'!W57=\"\",\"\",'BİLGİ GİRİŞİ'!W57)","v":""},null,null,null,{"$f":"IF('BİLGİ GİRİŞİ'!T57=\"\",\"\",IF('BİLGİ GİRİŞİ'!$BO$28=1,\"1\",'BİLGİ GİRİŞİ'!T57))","v":""}]
[{"$f":"IF('BİLGİ GİRİŞİ'!D58=\"\",\"\",'BİLGİ GİRİŞİ'!D58)","v":""},{"$f":"IF('BİLGİ GİRİŞİ'!E58=\"\",\"\",'BİLGİ GİRİŞİ'!E58)","v":""},null,null,null,null,null,null,null,null,null,null,null,null,null,{"$f":"IF('BİLGİ GİRİŞİ'!W58=\"\",\"\",'BİLGİ GİRİŞİ'!W58)","v":""},null,null,null,{"$f":"IF('BİLGİ GİRİŞİ'!T58=\"\",\"\",IF('BİLGİ GİRİŞİ'!$BO$28=1,\"1\",'BİLGİ GİRİŞİ'!T58))","v":""}]
[{"$f":"IF('BİLGİ GİRİŞİ'!D59=\"\",\"\",'BİLGİ GİRİŞİ'!D59)","v":""},{"$f":"IF('BİLGİ GİRİŞİ'!E59=\"\",\"\",'BİLGİ GİRİŞİ'!E59)","v":""},null,null,null,null,null,null,null,null,null,null,null,null,null,{"$f":"IF('BİLGİ GİRİŞİ'!W59=\"\",\"\",'BİLGİ GİRİŞİ'!W59)","v":""},null,null,null,{"$f":"IF('BİLGİ GİRİŞİ'!T59=\"\",\"\",IF('BİLGİ GİRİŞİ'!$BO$28=1,\"1\",'BİLGİ GİRİŞİ'!T59))","v":""}]
[{"$f":"IF('BİLGİ GİRİŞİ'!D60=\"\",\"\",'BİLGİ GİRİŞİ'!D60)","v":""},{"$f":"IF('BİLGİ GİRİŞİ'!E60=\"\",\"\",'BİLGİ GİRİŞİ'!E60)","v":""},null,null,null,null,null,null,null,null,null,null,null,null,null,{"$f":"IF('BİLGİ GİRİŞİ'!W60=\"\",\"\",'BİLGİ GİRİŞİ'!W60)","v":""},null,null,null,{"$f":"IF('BİLGİ GİRİŞİ'!T60=\"\",\"\",IF('BİLGİ GİRİŞİ'!$BO$28=1,\"1\",'BİLGİ GİRİŞİ'!T60))","v":""}]
[{"$f":"IF('BİLGİ GİRİŞİ'!D61=\"\",\"\",'BİLGİ GİRİŞİ'!D61)","v":""},{"$f":"IF('BİLGİ GİRİŞİ'!E61=\"\",\"\",'BİLGİ GİRİŞİ'!E61)","v":""},null,null,null,null,null,null,null,null,null,null,null,null,null,{"$f":"IF('BİLGİ GİRİŞİ'!W61=\"\",\"\",'BİLGİ GİRİŞİ'!W61)","v":""},null,null,null,{"$f":"IF('BİLGİ GİRİŞİ'!T61=\"\",\"\",IF('BİLGİ GİRİŞİ'!$BO$28=1,\"1\",'BİLGİ GİRİŞİ'!T61))","v":""}]
[{"$f":"IF('BİLGİ GİRİŞİ'!D62=\"\",\"\",'BİLGİ GİRİŞİ'!D62)","v":""},{"$f":"IF('BİLGİ GİRİŞİ'!E62=\"\",\"\",'BİLGİ GİRİŞİ'!E62)","v":""},null,null,null,null,null,null,null,null,null,null,null,null,null,{"$f":"IF('BİLGİ GİRİŞİ'!W62=\"\",\"\",'BİLGİ GİRİŞİ'!W62)","v":""},null,null,null,{"$f":"IF('BİLGİ GİRİŞİ'!T62=\"\",\"\",IF('BİLGİ GİRİŞİ'!$BO$28=1,\"1\",'BİLGİ GİRİŞİ'!T62))","v":""}]
[{"$f":"IF('BİLGİ GİRİŞİ'!D63=\"\",\"\",'BİLGİ GİRİŞİ'!D63)","v":""},{"$f":"IF('BİLGİ GİRİŞİ'!E63=\"\",\"\",'BİLGİ GİRİŞİ'!E63)","v":""},null,null,null,null,null,null,null,null,null,null,null,null,null,{"$f":"IF('BİLGİ GİRİŞİ'!W63=\"\",\"\",'BİLGİ GİRİŞİ'!W63)","v":""},null,null,null,{"$f":"IF('BİLGİ GİRİŞİ'!T63=\"\",\"\",IF('BİLGİ GİRİŞİ'!$BO$28=1,\"1\",'BİLGİ GİRİŞİ'!T63))","v":""}]
[{"$f":"IF('BİLGİ GİRİŞİ'!D64=\"\",\"\",'BİLGİ GİRİŞİ'!D64)","v":""},{"$f":"IF('BİLGİ GİRİŞİ'!E64=\"\",\"\",'BİLGİ GİRİŞİ'!E64)","v":""},null,null,null,null,null,null,null,null,null,null,null,null,null,{"$f":"IF('BİLGİ GİRİŞİ'!W64=\"\",\"\",'BİLGİ GİRİŞİ'!W64)","v":""},null,null,null,{"$f":"IF('BİLGİ GİRİŞİ'!T64=\"\",\"\",IF('BİLGİ GİRİŞİ'!$BO$28=1,\"1\",'BİLGİ GİRİŞİ'!T64))","v":""}]
[{"$f":"IF('BİLGİ GİRİŞİ'!D65=\"\",\"\",'BİLGİ GİRİŞİ'!D65)","v":""},{"$f":"IF('BİLGİ GİRİŞİ'!E65=\"\",\"\",'BİLGİ GİRİŞİ'!E65)","v":""},null,null,null,null,null,null,null,null,null,null,null,null,null,{"$f":"IF('BİLGİ GİRİŞİ'!W65=\"\",\"\",'BİLGİ GİRİŞİ'!W65)","v":""},null,null,null,{"$f":"IF('BİLGİ GİRİŞİ'!T65=\"\",\"\",IF('BİLGİ GİRİŞİ'!$BO$28=1,\"1\",'BİLGİ GİRİŞİ'!T65))","v":""}]
[{"$f":"IF('BİLGİ GİRİŞİ'!D66=\"\",\"\",'BİLGİ GİRİŞİ'!D66)","v":""},{"$f":"IF('BİLGİ GİRİŞİ'!E66=\"\",\"\",'BİLGİ GİRİŞİ'!E66)","v":""},null,null,null,null,null,null,null,null,null,null,null,null,null,{"$f":"IF('BİLGİ GİRİŞİ'!W66=\"\",\"\",'BİLGİ GİRİŞİ'!W66)","v":""},null,null,null,{"$f":"IF('BİLGİ GİRİŞİ'!T66=\"\",\"\",IF('BİLGİ GİRİŞİ'!$BO$28=1,\"1\",'BİLGİ GİRİŞİ'!T66))","v":""}]
[{"$f":"IF('BİLGİ GİRİŞİ'!D67=\"\",\"\",'BİLGİ GİRİŞİ'!D67)","v":""},{"$f":"IF('BİLGİ GİRİŞİ'!E67=\"\",\"\",'BİLGİ GİRİŞİ'!E67)","v":""},null,null,null,null,null,null,null,null,null,null,null,null,null,{"$f":"IF('BİLGİ GİRİŞİ'!W67=\"\",\"\",'BİLGİ GİRİŞİ'!W67)","v":""},null,null,null,{"$f":"IF('BİLGİ GİRİŞİ'!T67=\"\",\"\",IF('BİLGİ GİRİŞİ'!$BO$28=1,\"1\",'BİLGİ GİRİŞİ'!T67))","v":""}]
[{"$f":"IF('BİLGİ GİRİŞİ'!D68=\"\",\"\",'BİLGİ GİRİŞİ'!D68)","v":""},{"$f":"IF('BİLGİ GİRİŞİ'!E68=\"\",\"\",'BİLGİ GİRİŞİ'!E68)","v":""},null,null,null,null,null,null,null,null,null,null,null,null,null,{"$f":"IF('BİLGİ GİRİŞİ'!W68=\"\",\"\",'BİLGİ GİRİŞİ'!W68)","v":""},null,null,null,{"$f":"IF('BİLGİ GİRİŞİ'!T68=\"\",\"\",IF('BİLGİ GİRİŞİ'!$BO$28=1,\"1\",'BİLGİ GİRİŞİ'!T68))","v":""}]
[{"$f":"IF('BİLGİ GİRİŞİ'!D69=\"\",\"\",'BİLGİ GİRİŞİ'!D69)","v":""},{"$f":"IF('BİLGİ GİRİŞİ'!E69=\"\",\"\",'BİLGİ GİRİŞİ'!E69)","v":""},null,null,null,null,null,null,null,null,null,null,null,null,null,{"$f":"IF('BİLGİ GİRİŞİ'!W69=\"\",\"\",'BİLGİ GİRİŞİ'!W69)","v":""},null,null,null,{"$f":"IF('BİLGİ GİRİŞİ'!T69=\"\",\"\",IF('BİLGİ GİRİŞİ'!$BO$28=1,\"1\",'BİLGİ GİRİŞİ'!T69))","v":""}]
[{"$f":"IF('BİLGİ GİRİŞİ'!D70=\"\",\"\",'BİLGİ GİRİŞİ'!D70)","v":""},{"$f":"IF('BİLGİ GİRİŞİ'!E70=\"\",\"\",'BİLGİ GİRİŞİ'!E70)","v":""},null,null,null,null,null,null,null,null,null,null,null,null,null,{"$f":"IF('BİLGİ GİRİŞİ'!W70=\"\",\"\",'BİLGİ GİRİŞİ'!W70)","v":""},null,null,null,{"$f":"IF('BİLGİ GİRİŞİ'!T70=\"\",\"\",IF('BİLGİ GİRİŞİ'!$BO$28=1,\"1\",'BİLGİ GİRİŞİ'!T70))","v":""}]
[{"$f":"IF('BİLGİ GİRİŞİ'!D71=\"\",\"\",'BİLGİ GİRİŞİ'!D71)","v":""},{"$f":"IF('BİLGİ GİRİŞİ'!E71=\"\",\"\",'BİLGİ GİRİŞİ'!E71)","v":""},null,null,null,null,null,null,null,null,null,null,null,null,null,{"$f":"IF('BİLGİ GİRİŞİ'!W71=\"\",\"\",'BİLGİ GİRİŞİ'!W71)","v":""},null,null,null,{"$f":"IF('BİLGİ GİRİŞİ'!T71=\"\",\"\",IF('BİLGİ GİRİŞİ'!$BO$28=1,\"1\",'BİLGİ GİRİŞİ'!T71))","v":""}]
[{"$f":"IF('BİLGİ GİRİŞİ'!D72=\"\",\"\",'BİLGİ GİRİŞİ'!D72)","v":""},{"$f":"IF('BİLGİ GİRİŞİ'!E72=\"\",\"\",'BİLGİ GİRİŞİ'!E72)","v":""},null,null,null,null,null,null,null,null,null,null,null,null,null,{"$f":"IF('BİLGİ GİRİŞİ'!W72=\"\",\"\",'BİLGİ GİRİŞİ'!W72)","v":""},null,null,null,{"$f":"IF('BİLGİ GİRİŞİ'!T72=\"\",\"\",IF('BİLGİ GİRİŞİ'!$BO$28=1,\"1\",'BİLGİ GİRİŞİ'!T72))","v":""}]
[{"$f":"IF('BİLGİ GİRİŞİ'!D73=\"\",\"\",'BİLGİ GİRİŞİ'!D73)","v":""},{"$f":"IF('BİLGİ GİRİŞİ'!E73=\"\",\"\",'BİLGİ GİRİŞİ'!E73)","v":""},null,null,null,null,null,null,null,null,null,null,null,null,null,{"$f":"IF('BİLGİ GİRİŞİ'!W73=\"\",\"\",'BİLGİ GİRİŞİ'!W73)","v":""},null,null,null,{"$f":"IF('BİLGİ GİRİŞİ'!T73=\"\",\"\",IF('BİLGİ GİRİŞİ'!$BO$28=1,\"1\",'BİLGİ GİRİŞİ'!T73))","v":""}]
[{"$f":"IF('BİLGİ GİRİŞİ'!D74=\"\",\"\",'BİLGİ GİRİŞİ'!D74)","v":""},{"$f":"IF('BİLGİ GİRİŞİ'!E74=\"\",\"\",'BİLGİ GİRİŞİ'!E74)","v":""},null,null,null,null,null,null,null,null,null,null,null,null,null,{"$f":"IF('BİLGİ GİRİŞİ'!W74=\"\",\"\",'BİLGİ GİRİŞİ'!W74)","v":""},null,null,null,{"$f":"IF('BİLGİ GİRİŞİ'!T74=\"\",\"\",IF('BİLGİ GİRİŞİ'!$BO$28=1,\"1\",'BİLGİ GİRİŞİ'!T74))","v":""}]
[{"$f":"IF('BİLGİ GİRİŞİ'!D75=\"\",\"\",'BİLGİ GİRİŞİ'!D75)","v":""},{"$f":"IF('BİLGİ GİRİŞİ'!E75=\"\",\"\",'BİLGİ GİRİŞİ'!E75)","v":""},null,null,null,null,null,null,null,null,null,null,null,null,null,{"$f":"IF('BİLGİ GİRİŞİ'!W75=\"\",\"\",'BİLGİ GİRİŞİ'!W75)","v":""},null,null,null,{"$f":"IF('BİLGİ GİRİŞİ'!T75=\"\",\"\",IF('BİLGİ GİRİŞİ'!$BO$28=1,\"1\",'BİLGİ GİRİŞİ'!T75))","v":""}]
[{"$f":"IF('BİLGİ GİRİŞİ'!D76=\"\",\"\",'BİLGİ GİRİŞİ'!D76)","v":""},{"$f":"IF('BİLGİ GİRİŞİ'!E76=\"\",\"\",'BİLGİ GİRİŞİ'!E76)","v":""},null,null,null,null,null,null,null,null,null,null,null,null,null,{"$f":"IF('BİLGİ GİRİŞİ'!W76=\"\",\"\",'BİLGİ GİRİŞİ'!W76)","v":""},null,null,null,{"$f":"IF('BİLGİ GİRİŞİ'!T76=\"\",\"\",IF('BİLGİ GİRİŞİ'!$BO$28=1,\"1\",'BİLGİ GİRİŞİ'!T76))","v":""}]
[{"$f":"IF('BİLGİ GİRİŞİ'!D77=\"\",\"\",'BİLGİ GİRİŞİ'!D77)","v":""},{"$f":"IF('BİLGİ GİRİŞİ'!E77=\"\",\"\",'BİLGİ GİRİŞİ'!E77)","v":""},null,null,null,null,null,null,null,null,null,null,null,null,null,{"$f":"IF('BİLGİ GİRİŞİ'!W77=\"\",\"\",'BİLGİ GİRİŞİ'!W77)","v":""},null,null,null,{"$f":"IF('BİLGİ GİRİŞİ'!T77=\"\",\"\",IF('BİLGİ GİRİŞİ'!$BO$28=1,\"1\",'BİLGİ GİRİŞİ'!T77))","v":""}]
[{"$f":"IF('BİLGİ GİRİŞİ'!D78=\"\",\"\",'BİLGİ GİRİŞİ'!D78)","v":""},{"$f":"IF('BİLGİ GİRİŞİ'!E78=\"\",\"\",'BİLGİ GİRİŞİ'!E78)","v":""},null,null,null,null,null,null,null,null,null,null,null,null,null,{"$f":"IF('BİLGİ GİRİŞİ'!W78=\"\",\"\",'BİLGİ GİRİŞİ'!W78)","v":""},null,null,null,{"$f":"IF('BİLGİ GİRİŞİ'!T78=\"\",\"\",IF('BİLGİ GİRİŞİ'!$BO$28=1,\"1\",'BİLGİ GİRİŞİ'!T78))","v":""}]
[{"$f":"IF('BİLGİ GİRİŞİ'!D79=\"\",\"\",'BİLGİ GİRİŞİ'!D79)","v":""},{"$f":"IF('BİLGİ GİRİŞİ'!E79=\"\",\"\",'BİLGİ GİRİŞİ'!E79)","v":""},null,null,null,null,null,null,null,null,null,null,null,null,null,{"$f":"IF('BİLGİ GİRİŞİ'!W79=\"\",\"\",'BİLGİ GİRİŞİ'!W79)","v":""},null,null,null,{"$f":"IF('BİLGİ GİRİŞİ'!T79=\"\",\"\",IF('BİLGİ GİRİŞİ'!$BO$28=1,\"1\",'BİLGİ GİRİŞİ'!T79))","v":""}]
[{"$f":"IF('BİLGİ GİRİŞİ'!D80=\"\",\"\",'BİLGİ GİRİŞİ'!D80)","v":""},{"$f":"IF('BİLGİ GİRİŞİ'!E80=\"\",\"\",'BİLGİ GİRİŞİ'!E80)","v":""},null,null,null,null,null,null,null,null,null,null,null,null,null,{"$f":"IF('BİLGİ GİRİŞİ'!W80=\"\",\"\",'BİLGİ GİRİŞİ'!W80)","v":""},null,null,null,{"$f":"IF('BİLGİ GİRİŞİ'!T80=\"\",\"\",IF('BİLGİ GİRİŞİ'!$BO$28=1,\"1\",'BİLGİ GİRİŞİ'!T80))","v":""}]
[{"$f":"IF('BİLGİ GİRİŞİ'!D81=\"\",\"\",'BİLGİ GİRİŞİ'!D81)","v":""},{"$f":"IF('BİLGİ GİRİŞİ'!E81=\"\",\"\",'BİLGİ GİRİŞİ'!E81)","v":""},null,null,null,null,null,null,null,null,null,null,null,null,null,{"$f":"IF('BİLGİ GİRİŞİ'!W81=\"\",\"\",'BİLGİ GİRİŞİ'!W81)","v":""},null,null,null,{"$f":"IF('BİLGİ GİRİŞİ'!T81=\"\",\"\",IF('BİLGİ GİRİŞİ'!$BO$28=1,\"1\",'BİLGİ GİRİŞİ'!T81))","v":""}]
[{"$f":"IF('BİLGİ GİRİŞİ'!D82=\"\",\"\",'BİLGİ GİRİŞİ'!D82)","v":""},{"$f":"IF('BİLGİ GİRİŞİ'!E82=\"\",\"\",'BİLGİ GİRİŞİ'!E82)","v":""},null,null,null,null,null,null,null,null,null,null,null,null,null,{"$f":"IF('BİLGİ GİRİŞİ'!W82=\"\",\"\",'BİLGİ GİRİŞİ'!W82)","v":""},null,null,null,{"$f":"IF('BİLGİ GİRİŞİ'!T82=\"\",\"\",IF('BİLGİ GİRİŞİ'!$BO$28=1,\"1\",'BİLGİ GİRİŞİ'!T82))","v":""}]
[{"$f":"IF('BİLGİ GİRİŞİ'!D83=\"\",\"\",'BİLGİ GİRİŞİ'!D83)","v":""},{"$f":"IF('BİLGİ GİRİŞİ'!E83=\"\",\"\",'BİLGİ GİRİŞİ'!E83)","v":""},null,null,null,null,null,null,null,null,null,null,null,null,null,{"$f":"IF('BİLGİ GİRİŞİ'!W83=\"\",\"\",'BİLGİ GİRİŞİ'!W83)","v":""},null,null,null,{"$f":"IF('BİLGİ GİRİŞİ'!T83=\"\",\"\",IF('BİLGİ GİRİŞİ'!$BO$28=1,\"1\",'BİLGİ GİRİŞİ'!T83))","v":""}]
[{"$f":"IF('BİLGİ GİRİŞİ'!D84=\"\",\"\",'BİLGİ GİRİŞİ'!D84)","v":""},{"$f":"IF('BİLGİ GİRİŞİ'!E84=\"\",\"\",'BİLGİ GİRİŞİ'!E84)","v":""},null,null,null,null,null,null,null,null,null,null,null,null,null,{"$f":"IF('BİLGİ GİRİŞİ'!W84=\"\",\"\",'BİLGİ GİRİŞİ'!W84)","v":""},null,null,null,{"$f":"IF('BİLGİ GİRİŞİ'!T84=\"\",\"\",IF('BİLGİ GİRİŞİ'!$BO$28=1,\"1\",'BİLGİ GİRİŞİ'!T84))","v":""}]
[{"$f":"IF('BİLGİ GİRİŞİ'!D85=\"\",\"\",'BİLGİ GİRİŞİ'!D85)","v":""},{"$f":"IF('BİLGİ GİRİŞİ'!E85=\"\",\"\",'BİLGİ GİRİŞİ'!E85)","v":""},null,null,null,null,null,null,null,null,null,null,null,null,null,{"$f":"IF('BİLGİ GİRİŞİ'!W85=\"\",\"\",'BİLGİ GİRİŞİ'!W85)","v":""},null,null,null,{"$f":"IF('BİLGİ GİRİŞİ'!T85=\"\",\"\",IF('BİLGİ GİRİŞİ'!$BO$28=1,\"1\",'BİLGİ GİRİŞİ'!T85))","v":""}]
[{"$f":"IF('BİLGİ GİRİŞİ'!D86=\"\",\"\",'BİLGİ GİRİŞİ'!D86)","v":""},{"$f":"IF('BİLGİ GİRİŞİ'!E86=\"\",\"\",'BİLGİ GİRİŞİ'!E86)","v":""},null,null,null,null,null,null,null,null,null,null,null,null,null,{"$f":"IF('BİLGİ GİRİŞİ'!W86=\"\",\"\",'BİLGİ GİRİŞİ'!W86)","v":""},null,null,null,{"$f":"IF('BİLGİ GİRİŞİ'!T86=\"\",\"\",IF('BİLGİ GİRİŞİ'!$BO$28=1,\"1\",'BİLGİ GİRİŞİ'!T86))","v":""}]
[{"$f":"IF('BİLGİ GİRİŞİ'!D87=\"\",\"\",'BİLGİ GİRİŞİ'!D87)","v":""},{"$f":"IF('BİLGİ GİRİŞİ'!E87=\"\",\"\",'BİLGİ GİRİŞİ'!E87)","v":""},null,null,null,null,null,null,null,null,null,null,null,null,null,{"$f":"IF('BİLGİ GİRİŞİ'!W87=\"\",\"\",'BİLGİ GİRİŞİ'!W87)","v":""},null,null,null,{"$f":"IF('BİLGİ GİRİŞİ'!T87=\"\",\"\",IF('BİLGİ GİRİŞİ'!$BO$28=1,\"1\",'BİLGİ GİRİŞİ'!T87))","v":""}]
[{"$f":"IF('BİLGİ GİRİŞİ'!D88=\"\",\"\",'BİLGİ GİRİŞİ'!D88)","v":""},{"$f":"IF('BİLGİ GİRİŞİ'!E88=\"\",\"\",'BİLGİ GİRİŞİ'!E88)","v":""},null,null,null,null,null,null,null,null,null,null,null,null,null,{"$f":"IF('BİLGİ GİRİŞİ'!W88=\"\",\"\",'BİLGİ GİRİŞİ'!W88)","v":""},null,null,null,{"$f":"IF('BİLGİ GİRİŞİ'!T88=\"\",\"\",IF('BİLGİ GİRİŞİ'!$BO$28=1,\"1\",'BİLGİ GİRİŞİ'!T88))","v":""}]
[{"$f":"IF('BİLGİ GİRİŞİ'!D89=\"\",\"\",'BİLGİ GİRİŞİ'!D89)","v":""},{"$f":"IF('BİLGİ GİRİŞİ'!E89=\"\",\"\",'BİLGİ GİRİŞİ'!E89)","v":""},null,null,null,null,null,null,null,null,null,null,null,null,null,{"$f":"IF('BİLGİ GİRİŞİ'!W89=\"\",\"\",'BİLGİ GİRİŞİ'!W89)","v":""},null,null,null,{"$f":"IF('BİLGİ GİRİŞİ'!T89=\"\",\"\",IF('BİLGİ GİRİŞİ'!$BO$28=1,\"1\",'BİLGİ GİRİŞİ'!T89))","v":""}]
["TOPLAM (KDV Hariç)"]
[]
[null,null,null,null,null,null,null,null,null,null,null,null,null,null,null,null,null,null,null,null,"KİŞİ/FİRMA KAŞE/İMZA"]

{"sheet":"6","index":7,"n_rows":45,"n_cols":17,"rows_kept":45,"cut":false,"hidden":false,"merged":[[44,2,44,29],[33,2,33,29],[34,2,34,29],[35,2,35,29],[36,2,36,29],[37,2,37,29],[38,2,38,29],[39,2,39,29],[40,2,40,29],[41,2,41,29],[42,2,42,29],[43,2,43,29],[32,2,32,29],[20,2,20,29],[21,2,21,29],[22,2,22,29],[24,0,24,29],[25,2,25,29],[26,2,26,29],[27,2,27,29],[28,2,28,29],[29,2,29,29],[30,2,30,29],[31,2,31,29],[19,2,19,29],[8,2,8,29],[9,2,9,29],[10,2,10,29],[11,2,11,29],[12,2,12,29],[13,2,13,29],[14,2,14,29],[15,2,15,29],[16,2,16,29],[17,2,17,29],[18,2,18,29],[7,0,7,29],[1,0,1,9],[1,11,1,30],[2,0,2,9],[2,11,2,30],[3,0,3,9],[3,11,3,30],[4,0,4,9],[4,11,4,14],[4,16,4,30]]}
[]
["İdarenin Adı",null,null,null,null,null,null,null,null,null,":",{"$f":"IF('BİLGİ GİRİŞİ'!O8=\"\",\"\",'BİLGİ GİRİŞİ'!O8)","v":"Atatürk İlkokulu Müdürlüğü"}]
["Doğrudan Temin Numarası",null,null,null,null,null,null,null,null,null,":",{"$f":"IF('BİLGİ GİRİŞİ'!O11=\"\",\"\",'BİLGİ GİRİŞİ'!O11)","v":"22DT1211930"}]
["Mal/Hizmet/Yapım Adı, Niteliği ",null,null,null,null,null,null,null,null,null,":",{"$f":"IF('BİLGİ GİRİŞİ'!O9=\"\",\"\",'BİLGİ GİRİŞİ'!O9)","v":"Bilişim Malzemeleri Alımı"}]
["Alım/Görevlendirme Onay Tarihi/sayısı",null,null,null,null,null,null,null,null,null,":",{"$f":"IF('BİLGİ GİRİŞİ'!O15=\"\",\"\",'BİLGİ GİRİŞİ'!O15)","v":"2023-03-06"},null,null,null,"/",{"$f":"IF('BİLGİ GİRİŞİ'!S15=\"\",\"\",'BİLGİ GİRİŞİ'!S15)","v":456789123}]
[]
[]
["İDARİ ŞARTLAR"]
[{"$f":"IF('BİLGİ GİRİŞİ'!D166=\"\",\"\",'BİLGİ GİRİŞİ'!D166)","v":1},{"$f":"IF(C9=\"\",\"\",\"-\")","v":"-"},{"$f":"IF('BİLGİ GİRİŞİ'!E166=\"\",\"\",'BİLGİ GİRİŞİ'!E166)","v":"Bu bent boş bırakılmıştır."}]
[{"$f":"IF('BİLGİ GİRİŞİ'!D167=\"\",\"\",'BİLGİ GİRİŞİ'!D167)","v":""},{"$f":"IF(C10=\"\",\"\",\"-\")","v":""},{"$f":"IF('BİLGİ GİRİŞİ'!E167=\"\",\"\",'BİLGİ GİRİŞİ'!E167)","v":""}]
[{"$f":"IF('BİLGİ GİRİŞİ'!D168=\"\",\"\",'BİLGİ GİRİŞİ'!D168)","v":""},"",{"$f":"IF('BİLGİ GİRİŞİ'!E168=\"\",\"\",'BİLGİ GİRİŞİ'!E168)","v":""}]
[{"$f":"IF('BİLGİ GİRİŞİ'!D169=\"\",\"\",'BİLGİ GİRİŞİ'!D169)","v":""},"",{"$f":"IF('BİLGİ GİRİŞİ'!E169=\"\",\"\",'BİLGİ GİRİŞİ'!E169)","v":""}]
[{"$f":"IF('BİLGİ GİRİŞİ'!D170=\"\",\"\",'BİLGİ GİRİŞİ'!D170)","v":""},"",{"$f":"IF('BİLGİ GİRİŞİ'!E170=\"\",\"\",'BİLGİ GİRİŞİ'!E170)","v":""}]
[{"$f":"IF('BİLGİ GİRİŞİ'!D171=\"\",\"\",'BİLGİ GİRİŞİ'!D171)","v":""},"",{"$f":"IF('BİLGİ GİRİŞİ'!E171=\"\",\"\",'BİLGİ GİRİŞİ'!E171)","v":""}]
[{"$f":"IF('BİLGİ GİRİŞİ'!D172=\"\",\"\",'BİLGİ GİRİŞİ'!D172)","v":""},"",{"$f":"IF('BİLGİ GİRİŞİ'!E172=\"\",\"\",'BİLGİ GİRİŞİ'!E172)","v":""}]
[{"$f":"IF('BİLGİ GİRİŞİ'!D173=\"\",\"\",'BİLGİ GİRİŞİ'!D173)","v":""},"",{"$f":"IF('BİLGİ GİRİŞİ'!E173=\"\",\"\",'BİLGİ GİRİŞİ'!E173)","v":""}]
[{"$f":"IF('BİLGİ GİRİŞİ'!D174=\"\",\"\",'BİLGİ GİRİŞİ'!D174)","v":""},{"$f":"IF(C17=\"\",\"\",\"-\")","v":""},{"$f":"IF('BİLGİ GİRİŞİ'!E174=\"\",\"\",'BİLGİ GİRİŞİ'!E174)","v":""}]
[{"$f":"IF('BİLGİ GİRİŞİ'!D175=\"\",\"\",'BİLGİ GİRİŞİ'!D175)","v":""},{"$f":"IF(C18=\"\",\"\",\"-\")","v":""},{"$f":"IF('BİLGİ GİRİŞİ'!E175=\"\",\"\",'BİLGİ GİRİŞİ'!E175)","v":""}]
[{"$f":"IF('BİLGİ GİRİŞİ'!D176=\"\",\"\",'BİLGİ GİRİŞİ'!D176)","v":""},{"$f":"IF(C19=\"\",\"\",\"-\")","v":""},{"$f":"IF('BİLGİ GİRİŞİ'!E176=\"\",\"\",'BİLGİ GİRİŞİ'!E176)","v":""}]
[{"$f":"IF('BİLGİ GİRİŞİ'!D177=\"\",\"\",'BİLGİ GİRİŞİ'!D177)","v":""},"",{"$f":"IF('BİLGİ GİRİŞİ'!E177=\"\",\"\",'BİLGİ GİRİŞİ'!E177)","v":""}]
[{"$f":"IF('BİLGİ GİRİŞİ'!D178=\"\",\"\",'BİLGİ GİRİŞİ'!D178)","v":""},"",{"$f":"IF('BİLGİ GİRİŞİ'!E178=\"\",\"\",'BİLGİ GİRİŞİ'!E178)","v":""}]
[{"$f":"IF('BİLGİ GİRİŞİ'!D179=\"\",\"\",'BİLGİ GİRİŞİ'!D179)","v":""},"",{"$f":"IF('BİLGİ GİRİŞİ'!E179=\"\",\"\",'BİLGİ GİRİŞİ'!E179)","v":""}]
[{"$f":"IF('BİLGİ GİRİŞİ'!D180=\"\",\"\",'BİLGİ GİRİŞİ'!D180)","v":""},"",{"$f":"IF('BİLGİ GİRİŞİ'!E180=\"\",\"\",'BİLGİ GİRİŞİ'!E180)","v":""}]
[]
["TEKNİK ŞARTLAR"]
[{"$f":"IF('BİLGİ GİRİŞİ'!D183=\"\",\"\",'BİLGİ GİRİŞİ'!D183)","v":1},{"$f":"IF(C26=\"\",\"\",\"-\")","v":"-"},{"$f":"IF('BİLGİ GİRİŞİ'!E183=\"\",\"\",'BİLGİ GİRİŞİ'!E183)","v":"Bu bent boş bırakılmıştır."}]
[{"$f":"IF('BİLGİ GİRİŞİ'!D184=\"\",\"\",'BİLGİ GİRİŞİ'!D184)","v":""},"",{"$f":"IF('BİLGİ GİRİŞİ'!E184=\"\",\"\",'BİLGİ GİRİŞİ'!E184)","v":""}]
[{"$f":"IF('BİLGİ GİRİŞİ'!D185=\"\",\"\",'BİLGİ GİRİŞİ'!D185)","v":""},"",{"$f":"IF('BİLGİ GİRİŞİ'!E185=\"\",\"\",'BİLGİ GİRİŞİ'!E185)","v":""}]
[{"$f":"IF('BİLGİ GİRİŞİ'!D186=\"\",\"\",'BİLGİ GİRİŞİ'!D186)","v":""},"",{"$f":"IF('BİLGİ GİRİŞİ'!E186=\"\",\"\",'BİLGİ GİRİŞİ'!E186)","v":""}]
[{"$f":"IF('BİLGİ GİRİŞİ'!D187=\"\",\"\",'BİLGİ GİRİŞİ'!D187)","v":""},"",{"$f":"IF('BİLGİ GİRİŞİ'!E187=\"\",\"\",'BİLGİ GİRİŞİ'!E187)","v":""}]
[{"$f":"IF('BİLGİ GİRİŞİ'!D188=\"\",\"\",'BİLGİ GİRİŞİ'!D188)","v":""},"",{"$f":"IF('BİLGİ GİRİŞİ'!E188=\"\",\"\",'BİLGİ GİRİŞİ'!E188)","v":""}]
[{"$f":"IF('BİLGİ GİRİŞİ'!D189=\"\",\"\",'BİLGİ GİRİŞİ'!D189)","v":""},"",{"$f":"IF('BİLGİ GİRİŞİ'!E189=\"\",\"\",'BİLGİ GİRİŞİ'!E189)","v":""}]
[{"$f":"IF('BİLGİ GİRİŞİ'!D190=\"\",\"\",'BİLGİ GİRİŞİ'!D190)","v":""},"",{"$f":"IF('BİLGİ GİRİŞİ'!E190=\"\",\"\",'BİLGİ GİRİŞİ'!E190)","v":""}]
[{"$f":"IF('BİLGİ GİRİŞİ'!D191=\"\",\"\",'BİLGİ GİRİŞİ'!D191)","v":""},"",{"$f":"IF('BİLGİ GİRİŞİ'!E191=\"\",\"\",'BİLGİ GİRİŞİ'!E191)","v":""}]
[{"$f":"IF('BİLGİ GİRİŞİ'!D192=\"\",\"\",'BİLGİ GİRİŞİ'!D192)","v":""},"",{"$f":"IF('BİLGİ GİRİŞİ'!E192=\"\",\"\",'BİLGİ GİRİŞİ'!E192)","v":""}]
[{"$f":"IF('BİLGİ GİRİŞİ'!D193=\"\",\"\",'BİLGİ GİRİŞİ'!D193)","v":""},"",{"$f":"IF('BİLGİ GİRİŞİ'!E193=\"\",\"\",'BİLGİ GİRİŞİ'!E193)","v":""}]
[{"$f":"IF('BİLGİ GİRİŞİ'!D194=\"\",\"\",'BİLGİ GİRİŞİ'!D194)","v":""},"",{"$f":"IF('BİLGİ GİRİŞİ'!E194=\"\",\"\",'BİLGİ GİRİŞİ'!E194)","v":""}]
[{"$f":"IF('BİLGİ GİRİŞİ'!D195=\"\",\"\",'BİLGİ GİRİŞİ'!D195)","v":""},"",{"$f":"IF('BİLGİ GİRİŞİ'!E195=\"\",\"\",'BİLGİ GİRİŞİ'!E195)","v":""}]
[{"$f":"IF('BİLGİ GİRİŞİ'!D196=\"\",\"\",'BİLGİ GİRİŞİ'!D196)","v":""},"",{"$f":"IF('BİLGİ GİRİŞİ'!E196=\"\",\"\",'BİLGİ GİRİŞİ'!E196)","v":""}]
[{"$f":"IF('BİLGİ GİRİŞİ'!D197=\"\",\"\",'BİLGİ GİRİŞİ'!D197)","v":""},"",{"$f":"IF('BİLGİ GİRİŞİ'!E197=\"\",\"\",'BİLGİ GİRİŞİ'!E197)","v":""}]
[{"$f":"IF('BİLGİ GİRİŞİ'!D198=\"\",\"\",'BİLGİ GİRİŞİ'!D198)","v":""},"",{"$f":"IF('BİLGİ GİRİŞİ'!E198=\"\",\"\",'BİLGİ GİRİŞİ'!E198)","v":""}]
[{"$f":"IF('BİLGİ GİRİŞİ'!D199=\"\",\"\",'BİLGİ GİRİŞİ'!D199)","v":""},"",{"$f":"IF('BİLGİ GİRİŞİ'!E199=\"\",\"\",'BİLGİ GİRİŞİ'!E199)","v":""}]
[{"$f":"IF('BİLGİ GİRİŞİ'!D200=\"\",\"\",'BİLGİ GİRİŞİ'!D200)","v":""},"",{"$f":"IF('BİLGİ GİRİŞİ'!E200=\"\",\"\",'BİLGİ GİRİŞİ'!E200)","v":""}]
[{"$f":"IF('BİLGİ GİRİŞİ'!D201=\"\",\"\",'BİLGİ GİRİŞİ'!D201)","v":""},"",{"$f":"IF('BİLGİ GİRİŞİ'!E201=\"\",\"\",'BİLGİ GİRİŞİ'!E201)","v":""}]
[{"$f":"IF('BİLGİ GİRİŞİ'!D202=\"\",\"\",'BİLGİ GİRİŞİ'!D202)","v":""},"",{"$f":"IF('BİLGİ GİRİŞİ'!E202=\"\",\"\",'BİLGİ GİRİŞİ'!E202)","v":""}]

{"sheet":"7","index":8,"n_rows":87,"n_cols":44,"rows_kept":87,"cut":false,"hidden":false,"merged":[[69,1,69,14],[69,15,69,18],[69,19,69,22],[69,23,69,26],[69,27,69,30],[69,31,69,34],[69,35,69,38],[69,39,69,42],[69,43,69,46],[68,1,68,14],[68,15,68,18],[68,19,68,22],[68,23,68,26],[68,27,68,30],[68,31,68,34],[68,35,68,38],[68,39,68,42],[68,43,68,46],[67,1,67,14],[67,15,67,18],[67,19,67,22],[67,23,67,26],[67,27,67,30],[67,31,67,34],[67,35,67,38],[67,39,67,42],[67,43,67,46],[66,1,66,14],[66,15,66,18],[66,19,66,22],[66,23,66,26],[66,27,66,30],[66,31,66,34],[66,35,66,38],[66,39,66,42],[66,43,66,46],[65,1,65,14],[65,15,65,18],[65,19,65,22],[65,23,65,26],[65,27,65,30],[65,31,65,34],[65,35,65,38],[65,39,65,42],[65,43,65,46],[64,1,64,14],[64,15,64,18],[64,19,64,22],[64,23,64,26],[64,27,64,30],[64,31,64,34],[64,35,64,38],[64,39,64,42],[64,43,64,46],[63,1,63,14],[63,15,63,18],[63,19,63,22],[63,23,63,26],[63,27,63,30],[63,31,63,34],[63,35,63,38],[63,39,63,42],[63,43,63,46],[62,1,62,14],[62,15,62,18],[62,19,62,22],[62,23,62,26],[62,27,62,30],[62,31,62,34],[62,35,62,38],[62,39,62,42],[62,43,62,46],[61,1,61,14],[61,15,61,18],[61,19,61,22],[61,23,61,26],[61,27,61,30],[61,31,61,34],[61,35,61,38],[61,39,61,42],[61,43,61,46],[60,1,60,14],[60,15,60,18],[60,19,60,22],[60,23,60,26],[60,27,60,30],[60,31,60,34],[60,35,60,38],[60,39,60,42],[60,43,60,46],[59,1,59,14],[59,15,59,18],[59,19,59,22],[59,23,59,26],[59,27,59,30],[59,31,59,34],[59,35,59,38],[59,39,59,42],[59,43,59,46],[58,1,58,14],[58,15,58,18],[58,19,58,22],[58,23,58,26],[58,27,58,30],[58,31,58,34],[58,35,58,38],[58,39,58,42],[58,43,58,46],[57,1,57,14],[57,15,57,18],[57,19,57,22],[57,23,57,26],[57,27,57,30],[57,31,57,34],[57,35,57,38],[57,39,57,42],[57,43,57,46],[56,1,56,14],[56,15,56,18],[56,19,56,22],[56,23,56,26],[56,27,56,30],[56,31,56,34],[56,35,56,38],[56,39,56,42],[56,43,56,46],[55,1,55,14],[55,15,55,18],[55,19,55,22],[55,23,55,26],[55,27,55,30],[55,31,55,34],[55,35,55,38],[55,39,55,42],[55,43,55,46],[54,1,54,14],[54,15,54,18],[54,19,54,22],[54,23,54,26],[54,27,54,30],[54,31,54,34],[54,35,54,38],[54,39,54,42],[54,43,54,46],[53,1,53,14],[53,15,53,18],[53,19,53,22],[53,23,53,26],[53,27,53,30],[53,31,53,34],[53,35,53,38],[53,39,53,42],[53,43,53,46],[52,1,52,14],[52,15,52,18],[52,19,52,22],[52,23,52,26],[52,27,52,30],[52,31,52,34],[52,35,52,38],[52,39,52,42],[52,43,52,46],[51,1,51,14],[51,15,51,18],[51,19,51,22],[51,23,51,26],[51,27,51,30],[51,31,51,34],[51,35,51,38],[51,39,51,42],[51,43,51,46],[50,1,50,14],[50,15,50,18],[50,19,50,22],[50,23,50,26],[50,27,50,30],[50,31,50,34],[50,35,50,38],[50,39,50,42],[50,43,50,46],[77,0,79,46],[75,39,75,46],[75,23,75,38],[75,0,75,22],[71,0,71,22],[71,23,71,26],[71,27,71,30],[71,31,71,34],[71,35,71,38],[71,39,71,42],[71,43,71,46],[73,0,73,46],[74,39,74,46],[74,23,74,38],[74,0,74,22],[29,43,29,46],[70,1,70,14],[70,23,70,26],[70,27,70,30],[70,31,70,34],[70,35,70,38],[70,39,70,42],[70,43,70,46],[29,1,29,14],[29,23,29,26],[29,27,29,30],[29,31,29,34],[29,35,29,38],[29,39,29,42],[29,15,29,18],[70,15,70,18],[29,19,29,22],[70,19,70,22],[30,1,30,14],[31,1,31,14],[32,1,32,14],[33,1,33,14],[34,1,34,14],[35,1,35,14],[27,43,27,46],[28,1,28,14],[28,23,28,26],[28,27,28,30],[28,31,28,34],[28,35,28,38],[28,39,28,42],[28,43,28,46],[27,1,27,14],[27,23,27,26],[27,27,27,30],[27,31,27,34],[27,35,27,38],[27,39,27,42],[27,15,27,18],[28,15,28,18],[27,19,27,22],[28,19,28,22],[25,43,25,46],[26,1,26,14],[26,23,26,26],[26,27,26,30],[26,31,26,34],[26,35,26,38],[26,39,26,42],[26,43,26,46],[25,1,25,14],[25,23,25,26],[25,27,25,30],[25,31,25,34],[25,35,25,38],[25,39,25,42],[25,15,25,18],[26,15,26,18],[25,19,25,22],[26,19,26,22],[23,43,23,46],[24,1,24,14],[24,23,24,26],[24,27,24,30],[24,31,24,34],[24,35,24,38],[24,39,24,42],[24,43,24,46],[23,1,23,14],[23,23,23,26],[23,27,23,30],[23,31,23,34],[23,35,23,38],[23,39,23,42],[23,15,23,18],[24,15,24,18],[23,19,23,22],[24,19,24,22],[21,43,21,46],[22,1,22,14],[22,23,22,26],[22,27,22,30],[22,31,22,34],[22,35,22,38],[22,39,22,42],[22,43,22,46],[21,1,21,14],[21,23,21,26],[21,27,21,30],[21,31,21,34],[21,35,21,38],[21,39,21,42],[21,15,21,18],[22,15,22,18],[21,19,21,22],[22,19,22,22],[19,43,19,46],[20,1,20,14],[20,23,20,26],[20,27,20,30],[20,31,20,34],[20,35,20,38],[20,39,20,42],[20,43,20,46],[19,1,19,14],[19,23,19,26],[19,27,19,30],[19,31,19,34],[19,35,19,38],[19,39,19,42],[19,15,19,18],[20,15,20,18],[19,19,19,22],[20,19,20,22],[17,43,17,46],[18,1,18,14],[18,23,18,26],[18,27,18,30],[18,31,18,34],[18,35,18,38],[18,39,18,42],[18,43,18,46],[17,1,17,14],[17,23,17,26],[17,27,17,30],[17,31,17,34],[17,35,17,38],[17,39,17,42],[17,15,17,18],[18,15,18,18],[17,19,17,22],[18,19,18,22],[15,43,15,46],[16,1,16,14],[16,23,16,26],[16,27,16,30],[16,31,16,34],[16,35,16,38],[16,39,16,42],[16,43,16,46],[15,1,15,14],[15,23,15,26],[15,27,15,30],[15,31,15,34],[15,35,15,38],[15,39,15,42],[15,15,15,18],[16,15,16,18],[15,19,15,22],[16,19,16,22],[13,43,13,46],[14,1,14,14],[14,23,14,26],[14,27,14,30],[14,31,14,34],[14,35,14,38],[14,39,14,42],[14,43,14,46],[13,1,13,14],[13,23,13,26],[13,27,13,30],[13,31,13,34],[13,35,13,38],[13,39,13,42],[13,15,13,18],[14,15,14,18],[13,19,13,22],[14,19,14,22],[11,31,11,34],[11,35,11,38],[11,39,11,42],[11,43,11,46],[12,1,12,14],[12,23,12,26],[12,27,12,30],[11,1,11,14],[11,23,11,26],[11,27,11,30],[12,31,12,34],[12,35,12,38],[12,39,12,42],[12,43,12,46],[11,15,11,18],[11,19,11,22],[12,15,12,18],[12,19,12,22],[9,31,9,38],[9,39,9,46],[10,23,10,26],[10,27,10,30],[10,31,10,34],[10,35,10,38],[10,39,10,42],[10,43,10,46],[9,0,10,0],[9,1,10,14],[9,23,9,30],[9,15,10,18],[9,19,10,22],[6,0,6,9],[6,11,6,14],[6,16,6,46],[8,0,8,22],[8,23,8,46],[1,0,1,46],[3,0,3,9],[3,11,3,41],[3,42,3,46],[4,0,4,9],[4,11,4,46],[5,0,5,9],[5,11,5,46],[82,0,82,14],[85,0,85,14],[86,0,86,14],[82,15,82,30],[85,15,85,30],[86,15,86,30],[81,31,82,46],[85,31,85,46],[86,31,86,46],[36,1,36,14],[37,1,37,14],[38,1,38,14],[39,1,39,14],[40,1,40,14],[41,1,41,14],[42,1,42,14],[43,1,43,14],[44,1,44,14],[45,1,45,14],[46,1,46,14],[47,1,47,14],[48,1,48,14],[49,1,49,14],[30,15,30,18],[30,19,30,22],[30,23,30,26],[30,27,30,30],[32,15,32,18],[32,19,32,22],[32,23,32,26],[32,27,32,30],[34,15,34,18],[34,19,34,22],[34,23,34,26],[34,27,34,30],[36,15,36,18],[36,19,36,22],[36,23,36,26],[36,27,36,30],[38,15,38,18],[38,19,38,22],[38,23,38,26],[30,31,30,34],[30,35,30,38],[30,39,30,42],[30,43,30,46],[31,15,31,18],[31,19,31,22],[31,23,31,26],[31,27,31,30],[31,31,31,34],[31,35,31,38],[31,39,31,42],[31,43,31,46],[32,31,32,34],[32,35,32,38],[32,39,32,42],[32,43,32,46],[33,15,33,18],[33,19,33,22],[33,23,33,26],[33,27,33,30],[33,31,33,34],[33,35,33,38],[33,39,33,42],[33,43,33,46],[34,31,34,34],[34,35,34,38],[34,39,34,42],[34,43,34,46],[35,15,35,18],[35,19,35,22],[35,23,35,26],[35,27,35,30],[35,31,35,34],[35,35,35,38],[35,39,35,42],[35,43,35,46],[36,31,36,34],[36,35,36,38],[36,39,36,42],[36,43,36,46],[37,15,37,18],[37,19,37,22],[37,23,37,26],[37,27,37,30],[37,31,37,34],[37,35,37,38],[37,39,37,42],[37,43,37,46],[38,27,38,30],[38,31,38,34],[38,35,38,38],[38,39,38,42],[38,43,38,46],[39,15,39,18],[39,19,39,22],[39,23,39,26],[39,27,39,30],[39,31,39,34],[39,35,39,38],[39,39,39,42],[39,43,39,46],[40,15,40,18],[40,19,40,22],[40,23,40,26],[40,27,40,30],[40,31,40,34],[40,35,40,38],[40,39,40,42],[40,43,40,46],[41,15,41,18],[41,19,41,22],[41,23,41,26],[41,27,41,30],[41,31,41,34],[41,35,41,38],[41,39,41,42],[41,43,41,46],[42,15,42,18],[42,19,42,22],[42,23,42,26],[42,27,42,30],[42,31,42,34],[42,35,42,38],[42,39,42,42],[42,43,42,46],[43,15,43,18],[43,19,43,22],[43,23,43,26],[43,27,43,30],[43,31,43,34],[43,35,43,38],[43,39,43,42],[43,43,43,46],[44,15,44,18],[44,19,44,22],[44,23,44,26],[44,27,44,30],[44,31,44,34],[44,35,44,38],[44,39,44,42],[44,43,44,46],[45,15,45,18],[45,19,45,22],[45,23,45,26],[45,27,45,30],[45,31,45,34],[45,35,45,38],[45,39,45,42],[45,43,45,46],[46,15,46,18],[46,19,46,22],[46,23,46,26],[46,27,46,30],[46,31,46,34],[46,35,46,38],[46,39,46,42],[46,43,46,46],[47,15,47,18],[47,19,47,22],[47,23,47,26],[47,27,47,30],[47,31,47,34],[47,35,47,38],[47,39,47,42],[47,43,47,46],[48,15,48,18],[48,19,48,22],[48,23,48,26],[48,27,48,30],[48,31,48,34],[48,35,48,38],[48,39,48,42],[48,43,48,46],[49,15,49,18],[49,19,49,22],[49,23,49,26],[49,27,49,30],[49,31,49,34],[49,35,49,38],[49,39,49,42],[49,43,49,46]]}
[]
["PİYASA FİYAT ARAŞTIRMA TUTANAĞI"]
[]
["İdarenin Adı",null,null,null,null,null,null,null,null,null,":",{"$f":"IF('BİLGİ GİRİŞİ'!O8=\"\",\"\",'BİLGİ GİRİŞİ'!O8)","v":"Atatürk İlkokulu Müdürlüğü"},null,null,null,null,null,null,null,null,null,null,null,null,null,null,null,null,null,null,null,null,null,null,null,null,null,null,null,null,null,null,{"$f":"IF('BİLGİ GİRİŞİ'!O22=\"\",\"…../…../……..\",'BİLGİ GİRİŞİ'!O22)","v":"2023-03-08"}]
["Doğrudan Temin Numarası",null,null,null,null,null,null,null,null,null,":",{"$f":"IF('BİLGİ GİRİŞİ'!O11=\"\",\"\",'BİLGİ GİRİŞİ'!O11)","v":"22DT1211930"}]
["İş'in Adı, Türü",null,null,null,null,null,null,null,null,null,":",{"$f":"IF('BİLGİ GİRİŞİ'!O9=\"\",\"\",'BİLGİ GİRİŞİ'!O9)","v":"Bilişim Malzemeleri Alımı"}]
["Alım/Görevlendirme Onay Tarihi/sayısı",null,null,null,null,null,null,null,null,null,":",{"$f":"IF('BİLGİ GİRİŞİ'!O15=\"\",\"\",'BİLGİ GİRİŞİ'!O15)","v":"2023-03-06"},null,null,null,"/",{"$f":"IF('BİLGİ GİRİŞİ'!S15=\"\",\"\",'BİLGİ GİRİŞİ'!S15)","v":456789123}]
[]
["MAL'IN/HİZMET'İN/YAPIM İŞİ'NİN",null,null,null,null,null,null,null,null,null,null,null,null,null,null,null,null,null,null,null,null,null,null,"TEKLİF VEREN GERÇEK/TÜZEL KİŞİLER VE TEKLİF FİYATLARI"]
["S","Kalem/KısımBilgileri",null,null,null,null,null,null,null,null,null,null,null,null,null,"Birimi",null,null,null,"Miktarı",null,null,null,{"$f":"IF('BİLGİ GİRİŞİ'!AB95=\"\",\"\",'BİLGİ GİRİŞİ'!AB95)","v":"A GERÇEK/TÜZEL KİŞİSİ"},null,null,null,null,null,null,null,{"$f":"IF('BİLGİ GİRİŞİ'!AJ95=\"\",\"\",'BİLGİ GİRİŞİ'!AJ95)","v":"B GERÇEK/TÜZEL KİŞİSİ"},null,null,null,null,null,null,null,{"$f":"IF('BİLGİ GİRİŞİ'!AR95=\"\",\"\",'BİLGİ GİRİŞİ'!AR95)","v":"D GERÇEK/TÜZEL KİŞİSİ"}]
[null,null,null,null,null,null,null,null,null,null,null,null,null,null,null,null,null,null,null,null,null,null,null,"Birim Fiyat",null,null,null,"Toplam Fiyat",null,null,null,"Birim Fiyat",null,null,null,"Toplam Fiyat",null,null,null,"Birim Fiyat",null,null,null,"Toplam Fiyat"]
[{"$f":"IF('BİLGİ GİRİŞİ'!D30=\"\",\"\",'BİLGİ GİRİŞİ'!D30)","v":1},{"$f":"IF('BİLGİ GİRİŞİ'!E30=\"\",\"\",'BİLGİ GİRİŞİ'!E30)","v":"AIO (All In One) Masaüstü Bilgisayar "},null,null,null,null,null,null,null,null,null,null,null,null,null,{"$f":"IF('BİLGİ GİRİŞİ'!W30=\"\",\"\",'BİLGİ GİRİŞİ'!W30)","v":"Adet"},null,null,null,{"$f":"IF('BİLGİ GİRİŞİ'!T30=\"\",\"\",'BİLGİ GİRİŞİ'!T30)","v":2},null,null,null,{"$f":"IF('BİLGİ GİRİŞİ'!AB97=\"\",\"\",'BİLGİ GİRİŞİ'!AB97)","v":3000},null,null,null,{"$f":"IF('BİLGİ GİRİŞİ'!AF97=\"\",\"\",'BİLGİ GİRİŞİ'!AF97)","v":6000},null,null,null,{"$f":"IF('BİLGİ GİRİŞİ'!AJ97=\"\",\"\",'BİLGİ GİRİŞİ'!AJ97)","v":4000},null,null,null,{"$f":"IF('BİLGİ GİRİŞİ'!AN97=\"\",\"\",'BİLGİ GİRİŞİ'!AN97)","v":8000},null,null,null,{"$f":"IF('BİLGİ GİRİŞİ'!AR97=\"\",\"\",'BİLGİ GİRİŞİ'!AR97)","v":5000},null,null,null,{"$f":"IF('BİLGİ GİRİŞİ'!AV97=\"\",\"\",'BİLGİ GİRİŞİ'!AV97)","v":10000}]
[{"$f":"IF('BİLGİ GİRİŞİ'!D31=\"\",\"\",'BİLGİ GİRİŞİ'!D31)","v":2},{"$f":"IF('BİLGİ GİRİŞİ'!E31=\"\",\"\",'BİLGİ GİRİŞİ'!E31)","v":"Fotokopi Makinesi"},null,null,null,null,null,null,null,null,null,null,null,null,null,{"$f":"IF('BİLGİ GİRİŞİ'!W31=\"\",\"\",'BİLGİ GİRİŞİ'!W31)","v":"Adet"},null,null,null,{"$f":"IF('BİLGİ GİRİŞİ'!T31=\"\",\"\",'BİLGİ GİRİŞİ'!T31)","v":2},null,null,null,{"$f":"IF('BİLGİ GİRİŞİ'!AB98=\"\",\"\",'BİLGİ GİRİŞİ'!AB98)","v":4000},null,null,null,{"$f":"IF('BİLGİ GİRİŞİ'!AF98=\"\",\"\",'BİLGİ GİRİŞİ'!AF98)","v":8000},null,null,null,{"$f":"IF('BİLGİ GİRİŞİ'!AJ98=\"\",\"\",'BİLGİ GİRİŞİ'!AJ98)","v":5000},null,null,null,{"$f":"IF('BİLGİ GİRİŞİ'!AN98=\"\",\"\",'BİLGİ GİRİŞİ'!AN98)","v":10000},null,null,null,{"$f":"IF('BİLGİ GİRİŞİ'!AR98=\"\",\"\",'BİLGİ GİRİŞİ'!AR98)","v":6000},null,null,null,{"$f":"IF('BİLGİ GİRİŞİ'!AV98=\"\",\"\",'BİLGİ GİRİŞİ'!AV98)","v":12000}]
[{"$f":"IF('BİLGİ GİRİŞİ'!D32=\"\",\"\",'BİLGİ GİRİŞİ'!D32)","v":3},{"$f":"IF('BİLGİ GİRİŞİ'!E32=\"\",\"\",'BİLGİ GİRİŞİ'!E32)","v":"Projektör"},null,null,null,null,null,null,null,null,null,null,null,null,null,{"$f":"IF('BİLGİ GİRİŞİ'!W32=\"\",\"\",'BİLGİ GİRİŞİ'!W32)","v":"Adet"},null,null,null,{"$f":"IF('BİLGİ GİRİŞİ'!T32=\"\",\"\",'BİLGİ GİRİŞİ'!T32)","v":2},null,null,null,{"$f":"IF('BİLGİ GİRİŞİ'!AB99=\"\",\"\",'BİLGİ GİRİŞİ'!AB99)","v":5000},null,null,null,{"$f":"IF('BİLGİ GİRİŞİ'!AF99=\"\",\"\",'BİLGİ GİRİŞİ'!AF99)","v":10000},null,null,null,{"$f":"IF('BİLGİ GİRİŞİ'!AJ99=\"\",\"\",'BİLGİ GİRİŞİ'!AJ99)","v":6000},null,null,null,{"$f":"IF('BİLGİ GİRİŞİ'!AN99=\"\",\"\",'BİLGİ GİRİŞİ'!AN99)","v":12000},null,null,null,{"$f":"IF('BİLGİ GİRİŞİ'!AR99=\"\",\"\",'BİLGİ GİRİŞİ'!AR99)","v":7000},null,null,null,{"$f":"IF('BİLGİ GİRİŞİ'!AV99=\"\",\"\",'BİLGİ GİRİŞİ'!AV99)","v":14000}]
[{"$f":"IF('BİLGİ GİRİŞİ'!D33=\"\",\"\",'BİLGİ GİRİŞİ'!D33)","v":""},{"$f":"IF('BİLGİ GİRİŞİ'!E33=\"\",\"\",'BİLGİ GİRİŞİ'!E33)","v":""},null,null,null,null,null,null,null,null,null,null,null,null,null,{"$f":"IF('BİLGİ GİRİŞİ'!W33=\"\",\"\",'BİLGİ GİRİŞİ'!W33)","v":""},null,null,null,{"$f":"IF('BİLGİ GİRİŞİ'!T33=\"\",\"\",'BİLGİ GİRİŞİ'!T33)","v":""},null,null,null,{"$f":"IF('BİLGİ GİRİŞİ'!AB100=\"\",\"\",'BİLGİ GİRİŞİ'!AB100)","v":""},null,null,null,{"$f":"IF('BİLGİ GİRİŞİ'!AF100=\"\",\"\",'BİLGİ GİRİŞİ'!AF100)","v":""},null,null,null,{"$f":"IF('BİLGİ GİRİŞİ'!AJ100=\"\",\"\",'BİLGİ GİRİŞİ'!AJ100)","v":""},null,null,null,{"$f":"IF('BİLGİ GİRİŞİ'!AN100=\"\",\"\",'BİLGİ GİRİŞİ'!AN100)","v":""},null,null,null,{"$f":"IF('BİLGİ GİRİŞİ'!AR100=\"\",\"\",'BİLGİ GİRİŞİ'!AR100)","v":""},null,null,null,{"$f":"IF('BİLGİ GİRİŞİ'!AV100=\"\",\"\",'BİLGİ GİRİŞİ'!AV100)","v":""}]
[{"$f":"IF('BİLGİ GİRİŞİ'!D34=\"\",\"\",'BİLGİ GİRİŞİ'!D34)","v":""},{"$f":"IF('BİLGİ GİRİŞİ'!E34=\"\",\"\",'BİLGİ GİRİŞİ'!E34)","v":""},null,null,null,null,null,null,null,null,null,null,null,null,null,{"$f":"IF('BİLGİ GİRİŞİ'!W34=\"\",\"\",'BİLGİ GİRİŞİ'!W34)","v":""},null,null,null,{"$f":"IF('BİLGİ GİRİŞİ'!T34=\"\",\"\",'BİLGİ GİRİŞİ'!T34)","v":""},null,null,null,{"$f":"IF('BİLGİ GİRİŞİ'!AB101=\"\",\"\",'BİLGİ GİRİŞİ'!AB101)","v":""},null,null,null,{"$f":"IF('BİLGİ GİRİŞİ'!AF101=\"\",\"\",'BİLGİ GİRİŞİ'!AF101)","v":""},null,null,null,{"$f":"IF('BİLGİ GİRİŞİ'!AJ101=\"\",\"\",'BİLGİ GİRİŞİ'!AJ101)","v":""},null,null,null,{"$f":"IF('BİLGİ GİRİŞİ'!AN101=\"\",\"\",'BİLGİ GİRİŞİ'!AN101)","v":""},null,null,null,{"$f":"IF('BİLGİ GİRİŞİ'!AR101=\"\",\"\",'BİLGİ GİRİŞİ'!AR101)","v":""},null,null,null,{"$f":"IF('BİLGİ GİRİŞİ'!AV101=\"\",\"\",'BİLGİ GİRİŞİ'!AV101)","v":""}]
[{"$f":"IF('BİLGİ GİRİŞİ'!D35=\"\",\"\",'BİLGİ GİRİŞİ'!D35)","v":""},{"$f":"IF('BİLGİ GİRİŞİ'!E35=\"\",\"\",'BİLGİ GİRİŞİ'!E35)","v":""},null,null,null,null,null,null,null,null,null,null,null,null,null,{"$f":"IF('BİLGİ GİRİŞİ'!W35=\"\",\"\",'BİLGİ GİRİŞİ'!W35)","v":""},null,null,null,{"$f":"IF('BİLGİ GİRİŞİ'!T35=\"\",\"\",'BİLGİ GİRİŞİ'!T35)","v":""},null,null,null,{"$f":"IF('BİLGİ GİRİŞİ'!AB102=\"\",\"\",'BİLGİ GİRİŞİ'!AB102)","v":""},null,null,null,{"$f":"IF('BİLGİ GİRİŞİ'!AF102=\"\",\"\",'BİLGİ GİRİŞİ'!AF102)","v":""},null,null,null,{"$f":"IF('BİLGİ GİRİŞİ'!AJ102=\"\",\"\",'BİLGİ GİRİŞİ'!AJ102)","v":""},null,null,null,{"$f":"IF('BİLGİ GİRİŞİ'!AN102=\"\",\"\",'BİLGİ GİRİŞİ'!AN102)","v":""},null,null,null,{"$f":"IF('BİLGİ GİRİŞİ'!AR102=\"\",\"\",'BİLGİ GİRİŞİ'!AR102)","v":""},null,null,null,{"$f":"IF('BİLGİ GİRİŞİ'!AV102=\"\",\"\",'BİLGİ GİRİŞİ'!AV102)","v":""}]
[{"$f":"IF('BİLGİ GİRİŞİ'!D36=\"\",\"\",'BİLGİ GİRİŞİ'!D36)","v":""},{"$f":"IF('BİLGİ GİRİŞİ'!E36=\"\",\"\",'BİLGİ GİRİŞİ'!E36)","v":""},null,null,null,null,null,null,null,null,null,null,null,null,null,{"$f":"IF('BİLGİ GİRİŞİ'!W36=\"\",\"\",'BİLGİ GİRİŞİ'!W36)","v":""},null,null,null,{"$f":"IF('BİLGİ GİRİŞİ'!T36=\"\",\"\",'BİLGİ GİRİŞİ'!T36)","v":""},null,null,null,{"$f":"IF('BİLGİ GİRİŞİ'!AB103=\"\",\"\",'BİLGİ GİRİŞİ'!AB103)","v":""},null,null,null,{"$f":"IF('BİLGİ GİRİŞİ'!AF103=\"\",\"\",'BİLGİ GİRİŞİ'!AF103)","v":""},null,null,null,{"$f":"IF('BİLGİ GİRİŞİ'!AJ103=\"\",\"\",'BİLGİ GİRİŞİ'!AJ103)","v":""},null,null,null,{"$f":"IF('BİLGİ GİRİŞİ'!AN103=\"\",\"\",'BİLGİ GİRİŞİ'!AN103)","v":""},null,null,null,{"$f":"IF('BİLGİ GİRİŞİ'!AR103=\"\",\"\",'BİLGİ GİRİŞİ'!AR103)","v":""},null,null,null,{"$f":"IF('BİLGİ GİRİŞİ'!AV103=\"\",\"\",'BİLGİ GİRİŞİ'!AV103)","v":""}]
[{"$f":"IF('BİLGİ GİRİŞİ'!D37=\"\",\"\",'BİLGİ GİRİŞİ'!D37)","v":""},{"$f":"IF('BİLGİ GİRİŞİ'!E37=\"\",\"\",'BİLGİ GİRİŞİ'!E37)","v":""},null,null,null,null,null,null,null,null,null,null,null,null,null,{"$f":"IF('BİLGİ GİRİŞİ'!W37=\"\",\"\",'BİLGİ GİRİŞİ'!W37)","v":""},null,null,null,{"$f":"IF('BİLGİ GİRİŞİ'!T37=\"\",\"\",'BİLGİ GİRİŞİ'!T37)","v":""},null,null,null,{"$f":"IF('BİLGİ GİRİŞİ'!AB104=\"\",\"\",'BİLGİ GİRİŞİ'!AB104)","v":""},null,null,null,{"$f":"IF('BİLGİ GİRİŞİ'!AF104=\"\",\"\",'BİLGİ GİRİŞİ'!AF104)","v":""},null,null,null,{"$f":"IF('BİLGİ GİRİŞİ'!AJ104=\"\",\"\",'BİLGİ GİRİŞİ'!AJ104)","v":""},null,null,null,{"$f":"IF('BİLGİ GİRİŞİ'!AN104=\"\",\"\",'BİLGİ GİRİŞİ'!AN104)","v":""},null,null,null,{"$f":"IF('BİLGİ GİRİŞİ'!AR104=\"\",\"\",'BİLGİ GİRİŞİ'!AR104)","v":""},null,null,null,{"$f":"IF('BİLGİ GİRİŞİ'!AV104=\"\",\"\",'BİLGİ GİRİŞİ'!AV104)","v":""}]
[{"$f":"IF('BİLGİ GİRİŞİ'!D38=\"\",\"\",'BİLGİ GİRİŞİ'!D38)","v":""},{"$f":"IF('BİLGİ GİRİŞİ'!E38=\"\",\"\",'BİLGİ GİRİŞİ'!E38)","v":""},null,null,null,null,null,null,null,null,null,null,null,null,null,{"$f":"IF('BİLGİ GİRİŞİ'!W38=\"\",\"\",'BİLGİ GİRİŞİ'!W38)","v":""},null,null,null,{"$f":"IF('BİLGİ GİRİŞİ'!T38=\"\",\"\",'BİLGİ GİRİŞİ'!T38)","v":""},null,null,null,{"$f":"IF('BİLGİ GİRİŞİ'!AB105=\"\",\"\",'BİLGİ GİRİŞİ'!AB105)","v":""},null,null,null,{"$f":"IF('BİLGİ GİRİŞİ'!AF105=\"\",\"\",'BİLGİ GİRİŞİ'!AF105)","v":""},null,null,null,{"$f":"IF('BİLGİ GİRİŞİ'!AJ105=\"\",\"\",'BİLGİ GİRİŞİ'!AJ105)","v":""},null,null,null,{"$f":"IF('BİLGİ GİRİŞİ'!AN105=\"\",\"\",'BİLGİ GİRİŞİ'!AN105)","v":""},null,null,null,{"$f":"IF('BİLGİ GİRİŞİ'!AR105=\"\",\"\",'BİLGİ GİRİŞİ'!AR105)","v":""},null,null,null,{"$f":"IF('BİLGİ GİRİŞİ'!AV105=\"\",\"\",'BİLGİ GİRİŞİ'!AV105)","v":""}]
[{"$f":"IF('BİLGİ GİRİŞİ'!D39=\"\",\"\",'BİLGİ GİRİŞİ'!D39)","v":""},{"$f":"IF('BİLGİ GİRİŞİ'!E39=\"\",\"\",'BİLGİ GİRİŞİ'!E39)","v":""},null,null,null,null,null,null,null,null,null,null,null,null,null,{"$f":"IF('BİLGİ GİRİŞİ'!W39=\"\",\"\",'BİLGİ GİRİŞİ'!W39)","v":""},null,null,null,{"$f":"IF('BİLGİ GİRİŞİ'!T39=\"\",\"\",'BİLGİ GİRİŞİ'!T39)","v":""},null,null,null,{"$f":"IF('BİLGİ GİRİŞİ'!AB106=\"\",\"\",'BİLGİ GİRİŞİ'!AB106)","v":""},null,null,null,{"$f":"IF('BİLGİ GİRİŞİ'!AF106=\"\",\"\",'BİLGİ GİRİŞİ'!AF106)","v":""},null,null,null,{"$f":"IF('BİLGİ GİRİŞİ'!AJ106=\"\",\"\",'BİLGİ GİRİŞİ'!AJ106)","v":""},null,null,null,{"$f":"IF('BİLGİ GİRİŞİ'!AN106=\"\",\"\",'BİLGİ GİRİŞİ'!AN106)","v":""},null,null,null,{"$f":"IF('BİLGİ GİRİŞİ'!AR106=\"\",\"\",'BİLGİ GİRİŞİ'!AR106)","v":""},null,null,null,{"$f":"IF('BİLGİ GİRİŞİ'!AV106=\"\",\"\",'BİLGİ GİRİŞİ'!AV106)","v":""}]
[{"$f":"IF('BİLGİ GİRİŞİ'!D40=\"\",\"\",'BİLGİ GİRİŞİ'!D40)","v":""},{"$f":"IF('BİLGİ GİRİŞİ'!E40=\"\",\"\",'BİLGİ GİRİŞİ'!E40)","v":""},null,null,null,null,null,null,null,null,null,null,null,null,null,{"$f":"IF('BİLGİ GİRİŞİ'!W40=\"\",\"\",'BİLGİ GİRİŞİ'!W40)","v":""},null,null,null,{"$f":"IF('BİLGİ GİRİŞİ'!T40=\"\",\"\",'BİLGİ GİRİŞİ'!T40)","v":""},null,null,null,{"$f":"IF('BİLGİ GİRİŞİ'!AB107=\"\",\"\",'BİLGİ GİRİŞİ'!AB107)","v":""},null,null,null,{"$f":"IF('BİLGİ GİRİŞİ'!AF107=\"\",\"\",'BİLGİ GİRİŞİ'!AF107)","v":""},null,null,null,{"$f":"IF('BİLGİ GİRİŞİ'!AJ107=\"\",\"\",'BİLGİ GİRİŞİ'!AJ107)","v":""},null,null,null,{"$f":"IF('BİLGİ GİRİŞİ'!AN107=\"\",\"\",'BİLGİ GİRİŞİ'!AN107)","v":""},null,null,null,{"$f":"IF('BİLGİ GİRİŞİ'!AR107=\"\",\"\",'BİLGİ GİRİŞİ'!AR107)","v":""},null,null,null,{"$f":"IF('BİLGİ GİRİŞİ'!AV107=\"\",\"\",'BİLGİ GİRİŞİ'!AV107)","v":""}]
[{"$f":"IF('BİLGİ GİRİŞİ'!D41=\"\",\"\",'BİLGİ GİRİŞİ'!D41)","v":""},{"$f":"IF('BİLGİ GİRİŞİ'!E41=\"\",\"\",'BİLGİ GİRİŞİ'!E41)","v":""},null,null,null,null,null,null,null,null,null,null,null,null,null,{"$f":"IF('BİLGİ GİRİŞİ'!W41=\"\",\"\",'BİLGİ GİRİŞİ'!W41)","v":""},null,null,null,{"$f":"IF('BİLGİ GİRİŞİ'!T41=\"\",\"\",'BİLGİ GİRİŞİ'!T41)","v":""},null,null,null,{"$f":"IF('BİLGİ GİRİŞİ'!AB108=\"\",\"\",'BİLGİ GİRİŞİ'!AB108)","v":""},null,null,null,{"$f":"IF('BİLGİ GİRİŞİ'!AF108=\"\",\"\",'BİLGİ GİRİŞİ'!AF108)","v":""},null,null,null,{"$f":"IF('BİLGİ GİRİŞİ'!AJ108=\"\",\"\",'BİLGİ GİRİŞİ'!AJ108)","v":""},null,null,null,{"$f":"IF('BİLGİ GİRİŞİ'!AN108=\"\",\"\",'BİLGİ GİRİŞİ'!AN108)","v":""},null,null,null,{"$f":"IF('BİLGİ GİRİŞİ'!AR108=\"\",\"\",'BİLGİ GİRİŞİ'!AR108)","v":""},null,null,null,{"$f":"IF('BİLGİ GİRİŞİ'!AV108=\"\",\"\",'BİLGİ GİRİŞİ'!AV108)","v":""}]
[{"$f":"IF('BİLGİ GİRİŞİ'!D42=\"\",\"\",'BİLGİ GİRİŞİ'!D42)","v":""},{"$f":"IF('BİLGİ GİRİŞİ'!E42=\"\",\"\",'BİLGİ GİRİŞİ'!E42)","v":""},null,null,null,null,null,null,null,null,null,null,null,null,null,{"$f":"IF('BİLGİ GİRİŞİ'!W42=\"\",\"\",'BİLGİ GİRİŞİ'!W42)","v":""},null,null,null,{"$f":"IF('BİLGİ GİRİŞİ'!T42=\"\",\"\",'BİLGİ GİRİŞİ'!T42)","v":""},null,null,null,{"$f":"IF('BİLGİ GİRİŞİ'!AB109=\"\",\"\",'BİLGİ GİRİŞİ'!AB109)","v":""},null,null,null,{"$f":"IF('BİLGİ GİRİŞİ'!AF109=\"\",\"\",'BİLGİ GİRİŞİ'!AF109)","v":""},null,null,null,{"$f":"IF('BİLGİ GİRİŞİ'!AJ109=\"\",\"\",'BİLGİ GİRİŞİ'!AJ109)","v":""},null,null,null,{"$f":"IF('BİLGİ GİRİŞİ'!AN109=\"\",\"\",'BİLGİ GİRİŞİ'!AN109)","v":""},null,null,null,{"$f":"IF('BİLGİ GİRİŞİ'!AR109=\"\",\"\",'BİLGİ GİRİŞİ'!AR109)","v":""},null,null,null,{"$f":"IF('BİLGİ GİRİŞİ'!AV109=\"\",\"\",'BİLGİ GİRİŞİ'!AV109)","v":""}]
[{"$f":"IF('BİLGİ GİRİŞİ'!D43=\"\",\"\",'BİLGİ GİRİŞİ'!D43)","v":""},{"$f":"IF('BİLGİ GİRİŞİ'!E43=\"\",\"\",'BİLGİ GİRİŞİ'!E43)","v":""},null,null,null,null,null,null,null,null,null,null,null,null,null,{"$f":"IF('BİLGİ GİRİŞİ'!W43=\"\",\"\",'BİLGİ GİRİŞİ'!W43)","v":""},null,null,null,{"$f":"IF('BİLGİ GİRİŞİ'!T43=\"\",\"\",'BİLGİ GİRİŞİ'!T43)","v":""},null,null,null,{"$f":"IF('BİLGİ GİRİŞİ'!AB110=\"\",\"\",'BİLGİ GİRİŞİ'!AB110)","v":""},null,null,null,{"$f":"IF('BİLGİ GİRİŞİ'!AF110=\"\",\"\",'BİLGİ GİRİŞİ'!AF110)","v":""},null,null,null,{"$f":"IF('BİLGİ GİRİŞİ'!AJ110=\"\",\"\",'BİLGİ GİRİŞİ'!AJ110)","v":""},null,null,null,{"$f":"IF('BİLGİ GİRİŞİ'!AN110=\"\",\"\",'BİLGİ GİRİŞİ'!AN110)","v":""},null,null,null,{"$f":"IF('BİLGİ GİRİŞİ'!AR110=\"\",\"\",'BİLGİ GİRİŞİ'!AR110)","v":""},null,null,null,{"$f":"IF('BİLGİ GİRİŞİ'!AV110=\"\",\"\",'BİLGİ GİRİŞİ'!AV110)","v":""}]
[{"$f":"IF('BİLGİ GİRİŞİ'!D44=\"\",\"\",'BİLGİ GİRİŞİ'!D44)","v":""},{"$f":"IF('BİLGİ GİRİŞİ'!E44=\"\",\"\",'BİLGİ GİRİŞİ'!E44)","v":""},null,null,null,null,null,null,null,null,null,null,null,null,null,{"$f":"IF('BİLGİ GİRİŞİ'!W44=\"\",\"\",'BİLGİ GİRİŞİ'!W44)","v":""},null,null,null,{"$f":"IF('BİLGİ GİRİŞİ'!T44=\"\",\"\",'BİLGİ GİRİŞİ'!T44)","v":""},null,null,null,{"$f":"IF('BİLGİ GİRİŞİ'!AB111=\"\",\"\",'BİLGİ GİRİŞİ'!AB111)","v":""},null,null,null,{"$f":"IF('BİLGİ GİRİŞİ'!AF111=\"\",\"\",'BİLGİ GİRİŞİ'!AF111)","v":""},null,null,null,{"$f":"IF('BİLGİ GİRİŞİ'!AJ111=\"\",\"\",'BİLGİ GİRİŞİ'!AJ111)","v":""},null,null,null,{"$f":"IF('BİLGİ GİRİŞİ'!AN111=\"\",\"\",'BİLGİ GİRİŞİ'!AN111)","v":""},null,null,null,{"$f":"IF('BİLGİ GİRİŞİ'!AR111=\"\",\"\",'BİLGİ GİRİŞİ'!AR111)","v":""},null,null,null,{"$f":"IF('BİLGİ GİRİŞİ'!AV111=\"\",\"\",'BİLGİ GİRİŞİ'!AV111)","v":""}]
[{"$f":"IF('BİLGİ GİRİŞİ'!D45=\"\",\"\",'BİLGİ GİRİŞİ'!D45)","v":""},{"$f":"IF('BİLGİ GİRİŞİ'!E45=\"\",\"\",'BİLGİ GİRİŞİ'!E45)","v":""},null,null,null,null,null,null,null,null,null,null,null,null,null,{"$f":"IF('BİLGİ GİRİŞİ'!W45=\"\",\"\",'BİLGİ GİRİŞİ'!W45)","v":""},null,null,null,{"$f":"IF('BİLGİ GİRİŞİ'!T45=\"\",\"\",'BİLGİ GİRİŞİ'!T45)","v":""},null,null,null,{"$f":"IF('BİLGİ GİRİŞİ'!AB112=\"\",\"\",'BİLGİ GİRİŞİ'!AB112)","v":""},null,null,null,{"$f":"IF('BİLGİ GİRİŞİ'!AF112=\"\",\"\",'BİLGİ GİRİŞİ'!AF112)","v":""},null,null,null,{"$f":"IF('BİLGİ GİRİŞİ'!AJ112=\"\",\"\",'BİLGİ GİRİŞİ'!AJ112)","v":""},null,null,null,{"$f":"IF('BİLGİ GİRİŞİ'!AN112=\"\",\"\",'BİLGİ GİRİŞİ'!AN112)","v":""},null,null,null,{"$f":"IF('BİLGİ GİRİŞİ'!AR112=\"\",\"\",'BİLGİ GİRİŞİ'!AR112)","v":""},null,null,null,{"$f":"IF('BİLGİ GİRİŞİ'!AV112=\"\",\"\",'BİLGİ GİRİŞİ'!AV112)","v":""}]
[{"$f":"IF('BİLGİ GİRİŞİ'!D46=\"\",\"\",'BİLGİ GİRİŞİ'!D46)","v":""},{"$f":"IF('BİLGİ GİRİŞİ'!E46=\"\",\"\",'BİLGİ GİRİŞİ'!E46)","v":""},null,null,null,null,null,null,null,null,null,null,null,null,null,{"$f":"IF('BİLGİ GİRİŞİ'!W46=\"\",\"\",'BİLGİ GİRİŞİ'!W46)","v":""},null,null,null,{"$f":"IF('BİLGİ GİRİŞİ'!T46=\"\",\"\",'BİLGİ GİRİŞİ'!T46)","v":""},null,null,null,{"$f":"IF('BİLGİ GİRİŞİ'!AB113=\"\",\"\",'BİLGİ GİRİŞİ'!AB113)","v":""},null,null,null,{"$f":"IF('BİLGİ GİRİŞİ'!AF113=\"\",\"\",'BİLGİ GİRİŞİ'!AF113)","v":""},null,null,null,{"$f":"IF('BİLGİ GİRİŞİ'!AJ113=\"\",\"\",'BİLGİ GİRİŞİ'!AJ113)","v":""},null,null,null,{"$f":"IF('BİLGİ GİRİŞİ'!AN113=\"\",\"\",'BİLGİ GİRİŞİ'!AN113)","v":""},null,null,null,{"$f":"IF('BİLGİ GİRİŞİ'!AR113=\"\",\"\",'BİLGİ GİRİŞİ'!AR113)","v":""},null,null,null,{"$f":"IF('BİLGİ GİRİŞİ'!AV113=\"\",\"\",'BİLGİ GİRİŞİ'!AV113)","v":""}]
[{"$f":"IF('BİLGİ GİRİŞİ'!D47=\"\",\"\",'BİLGİ GİRİŞİ'!D47)","v":""},{"$f":"IF('BİLGİ GİRİŞİ'!E47=\"\",\"\",'BİLGİ GİRİŞİ'!E47)","v":""},null,null,null,null,null,null,null,null,null,null,null,null,null,{"$f":"IF('BİLGİ GİRİŞİ'!W47=\"\",\"\",'BİLGİ GİRİŞİ'!W47)","v":""},null,null,null,{"$f":"IF('BİLGİ GİRİŞİ'!T47=\"\",\"\",'BİLGİ GİRİŞİ'!T47)","v":""},null,null,null,{"$f":"IF('BİLGİ GİRİŞİ'!AB114=\"\",\"\",'BİLGİ GİRİŞİ'!AB114)","v":""},null,null,null,{"$f":"IF('BİLGİ GİRİŞİ'!AF114=\"\",\"\",'BİLGİ GİRİŞİ'!AF114)","v":""},null,null,null,{"$f":"IF('BİLGİ GİRİŞİ'!AJ114=\"\",\"\",'BİLGİ GİRİŞİ'!AJ114)","v":""},null,null,null,{"$f":"IF('BİLGİ GİRİŞİ'!AN114=\"\",\"\",'BİLGİ GİRİŞİ'!AN114)","v":""},null,null,null,{"$f":"IF('BİLGİ GİRİŞİ'!AR114=\"\",\"\",'BİLGİ GİRİŞİ'!AR114)","v":""},null,null,null,{"$f":"IF('BİLGİ GİRİŞİ'!AV114=\"\",\"\",'BİLGİ GİRİŞİ'!AV114)","v":""}]
[{"$f":"IF('BİLGİ GİRİŞİ'!D48=\"\",\"\",'BİLGİ GİRİŞİ'!D48)","v":""},{"$f":"IF('BİLGİ GİRİŞİ'!E48=\"\",\"\",'BİLGİ GİRİŞİ'!E48)","v":""},null,null,null,null,null,null,null,null,null,null,null,null,null,{"$f":"IF('BİLGİ GİRİŞİ'!W48=\"\",\"\",'BİLGİ GİRİŞİ'!W48)","v":""},null,null,null,{"$f":"IF('BİLGİ GİRİŞİ'!T48=\"\",\"\",'BİLGİ GİRİŞİ'!T48)","v":""},null,null,null,{"$f":"IF('BİLGİ GİRİŞİ'!AB115=\"\",\"\",'BİLGİ GİRİŞİ'!AB115)","v":""},null,null,null,{"$f":"IF('BİLGİ GİRİŞİ'!AF115=\"\",\"\",'BİLGİ GİRİŞİ'!AF115)","v":""},null,null,null,{"$f":"IF('BİLGİ GİRİŞİ'!AJ115=\"\",\"\",'BİLGİ GİRİŞİ'!AJ115)","v":""},null,null,null,{"$f":"IF('BİLGİ GİRİŞİ'!AN115=\"\",\"\",'BİLGİ GİRİŞİ'!AN115)","v":""},null,null,null,{"$f":"IF('BİLGİ GİRİŞİ'!AR115=\"\",\"\",'BİLGİ GİRİŞİ'!AR115)","v":""},null,null,null,{"$f":"IF('BİLGİ GİRİŞİ'!AV115=\"\",\"\",'BİLGİ GİRİŞİ'!AV115)","v":""}]
[{"$f":"IF('BİLGİ GİRİŞİ'!D49=\"\",\"\",'BİLGİ GİRİŞİ'!D49)","v":""},{"$f":"IF('BİLGİ GİRİŞİ'!E49=\"\",\"\",'BİLGİ GİRİŞİ'!E49)","v":""},null,null,null,null,null,null,null,null,null,null,null,null,null,{"$f":"IF('BİLGİ GİRİŞİ'!W49=\"\",\"\",'BİLGİ GİRİŞİ'!W49)","v":""},null,null,null,{"$f":"IF('BİLGİ GİRİŞİ'!T49=\"\",\"\",'BİLGİ GİRİŞİ'!T49)","v":""},null,null,null,{"$f":"IF('BİLGİ GİRİŞİ'!AB116=\"\",\"\",'BİLGİ GİRİŞİ'!AB116)","v":""},null,null,null,{"$f":"IF('BİLGİ GİRİŞİ'!AF116=\"\",\"\",'BİLGİ GİRİŞİ'!AF116)","v":""},null,null,null,{"$f":"IF('BİLGİ GİRİŞİ'!AJ116=\"\",\"\",'BİLGİ GİRİŞİ'!AJ116)","v":""},null,null,null,{"$f":"IF('BİLGİ GİRİŞİ'!AN116=\"\",\"\",'BİLGİ GİRİŞİ'!AN116)","v":""},null,null,null,{"$f":"IF('BİLGİ GİRİŞİ'!AR116=\"\",\"\",'BİLGİ GİRİŞİ'!AR116)","v":""},null,null,null,{"$f":"IF('BİLGİ GİRİŞİ'!AV116=\"\",\"\",'BİLGİ GİRİŞİ'!AV116)","v":""}]
[{"$f":"IF('BİLGİ GİRİŞİ'!D50=\"\",\"\",'BİLGİ GİRİŞİ'!D50)","v":""},{"$f":"IF('BİLGİ GİRİŞİ'!E50=\"\",\"\",'BİLGİ GİRİŞİ'!E50)","v":""},null,null,null,null,null,null,null,null,null,null,null,null,null,{"$f":"IF('BİLGİ GİRİŞİ'!W50=\"\",\"\",'BİLGİ GİRİŞİ'!W50)","v":""},null,null,null,{"$f":"IF('BİLGİ GİRİŞİ'!T50=\"\",\"\",'BİLGİ GİRİŞİ'!T50)","v":""},null,null,null,{"$f":"IF('BİLGİ GİRİŞİ'!AB117=\"\",\"\",'BİLGİ GİRİŞİ'!AB117)","v":""},null,null,null,{"$f":"IF('BİLGİ GİRİŞİ'!AF117=\"\",\"\",'BİLGİ GİRİŞİ'!AF117)","v":""},null,null,null,{"$f":"IF('BİLGİ GİRİŞİ'!AJ117=\"\",\"\",'BİLGİ GİRİŞİ'!AJ117)","v":""},null,null,null,{"$f":"IF('BİLGİ GİRİŞİ'!AN117=\"\",\"\",'BİLGİ GİRİŞİ'!AN117)","v":""},null,null,null,{"$f":"IF('BİLGİ GİRİŞİ'!AR117=\"\",\"\",'BİLGİ GİRİŞİ'!AR117)","v":""},null,null,null,{"$f":"IF('BİLGİ GİRİŞİ'!AV117=\"\",\"\",'BİLGİ GİRİŞİ'!AV117)","v":""}]
[{"$f":"IF('BİLGİ GİRİŞİ'!D51=\"\",\"\",'BİLGİ GİRİŞİ'!D51)","v":""},{"$f":"IF('BİLGİ GİRİŞİ'!E51=\"\",\"\",'BİLGİ GİRİŞİ'!E51)","v":""},null,null,null,null,null,null,null,null,null,null,null,null,null,{"$f":"IF('BİLGİ GİRİŞİ'!W51=\"\",\"\",'BİLGİ GİRİŞİ'!W51)","v":""},null,null,null,{"$f":"IF('BİLGİ GİRİŞİ'!T51=\"\",\"\",'BİLGİ GİRİŞİ'!T51)","v":""},null,null,null,{"$f":"IF('BİLGİ GİRİŞİ'!AB118=\"\",\"\",'BİLGİ GİRİŞİ'!AB118)","v":""},null,null,null,{"$f":"IF('BİLGİ GİRİŞİ'!AF118=\"\",\"\",'BİLGİ GİRİŞİ'!AF118)","v":""},null,null,null,{"$f":"IF('BİLGİ GİRİŞİ'!AJ118=\"\",\"\",'BİLGİ GİRİŞİ'!AJ118)","v":""},null,null,null,{"$f":"IF('BİLGİ GİRİŞİ'!AN118=\"\",\"\",'BİLGİ GİRİŞİ'!AN118)","v":""},null,null,null,{"$f":"IF('BİLGİ GİRİŞİ'!AR118=\"\",\"\",'BİLGİ GİRİŞİ'!AR118)","v":""},null,null,null,{"$f":"IF('BİLGİ GİRİŞİ'!AV118=\"\",\"\",'BİLGİ GİRİŞİ'!AV118)","v":""}]
[{"$f":"IF('BİLGİ GİRİŞİ'!D52=\"\",\"\",'BİLGİ GİRİŞİ'!D52)","v":""},{"$f":"IF('BİLGİ GİRİŞİ'!E52=\"\",\"\",'BİLGİ GİRİŞİ'!E52)","v":""},null,null,null,null,null,null,null,null,null,null,null,null,null,{"$f":"IF('BİLGİ GİRİŞİ'!W52=\"\",\"\",'BİLGİ GİRİŞİ'!W52)","v":""},null,null,null,{"$f":"IF('BİLGİ GİRİŞİ'!T52=\"\",\"\",'BİLGİ GİRİŞİ'!T52)","v":""},null,null,null,{"$f":"IF('BİLGİ GİRİŞİ'!AB119=\"\",\"\",'BİLGİ GİRİŞİ'!AB119)","v":""},null,null,null,{"$f":"IF('BİLGİ GİRİŞİ'!AF119=\"\",\"\",'BİLGİ GİRİŞİ'!AF119)","v":""},null,null,null,{"$f":"IF('BİLGİ GİRİŞİ'!AJ119=\"\",\"\",'BİLGİ GİRİŞİ'!AJ119)","v":""},null,null,null,{"$f":"IF('BİLGİ GİRİŞİ'!AN119=\"\",\"\",'BİLGİ GİRİŞİ'!AN119)","v":""},null,null,null,{"$f":"IF('BİLGİ GİRİŞİ'!AR119=\"\",\"\",'BİLGİ GİRİŞİ'!AR119)","v":""},null,null,null,{"$f":"IF('BİLGİ GİRİŞİ'!AV119=\"\",\"\",'BİLGİ GİRİŞİ'!AV119)","v":""}]
[{"$f":"IF('BİLGİ GİRİŞİ'!D53=\"\",\"\",'BİLGİ GİRİŞİ'!D53)","v":""},{"$f":"IF('BİLGİ GİRİŞİ'!E53=\"\",\"\",'BİLGİ GİRİŞİ'!E53)","v":""},null,null,null,null,null,null,null,null,null,null,null,null,null,{"$f":"IF('BİLGİ GİRİŞİ'!W53=\"\",\"\",'BİLGİ GİRİŞİ'!W53)","v":""},null,null,null,{"$f":"IF('BİLGİ GİRİŞİ'!T53=\"\",\"\",'BİLGİ GİRİŞİ'!T53)","v":""},null,null,null,{"$f":"IF('BİLGİ GİRİŞİ'!AB120=\"\",\"\",'BİLGİ GİRİŞİ'!AB120)","v":""},null,null,null,{"$f":"IF('BİLGİ GİRİŞİ'!AF120=\"\",\"\",'BİLGİ GİRİŞİ'!AF120)","v":""},null,null,null,{"$f":"IF('BİLGİ GİRİŞİ'!AJ120=\"\",\"\",'BİLGİ GİRİŞİ'!AJ120)","v":""},null,null,null,{"$f":"IF('BİLGİ GİRİŞİ'!AN120=\"\",\"\",'BİLGİ GİRİŞİ'!AN120)","v":""},null,null,null,{"$f":"IF('BİLGİ GİRİŞİ'!AR120=\"\",\"\",'BİLGİ GİRİŞİ'!AR120)","v":""},null,null,null,{"$f":"IF('BİLGİ GİRİŞİ'!AV120=\"\",\"\",'BİLGİ GİRİŞİ'!AV120)","v":""}]
[{"$f":"IF('BİLGİ GİRİŞİ'!D54=\"\",\"\",'BİLGİ GİRİŞİ'!D54)","v":""},{"$f":"IF('BİLGİ GİRİŞİ'!E54=\"\",\"\",'BİLGİ GİRİŞİ'!E54)","v":""},null,null,null,null,null,null,null,null,null,null,null,null,null,{"$f":"IF('BİLGİ GİRİŞİ'!W54=\"\",\"\",'BİLGİ GİRİŞİ'!W54)","v":""},null,null,null,{"$f":"IF('BİLGİ GİRİŞİ'!T54=\"\",\"\",'BİLGİ GİRİŞİ'!T54)","v":""},null,null,null,{"$f":"IF('BİLGİ GİRİŞİ'!AB121=\"\",\"\",'BİLGİ GİRİŞİ'!AB121)","v":""},null,null,null,{"$f":"IF('BİLGİ GİRİŞİ'!AF121=\"\",\"\",'BİLGİ GİRİŞİ'!AF121)","v":""},null,null,null,{"$f":"IF('BİLGİ GİRİŞİ'!AJ121=\"\",\"\",'BİLGİ GİRİŞİ'!AJ121)","v":""},null,null,null,{"$f":"IF('BİLGİ GİRİŞİ'!AN121=\"\",\"\",'BİLGİ GİRİŞİ'!AN121)","v":""},null,null,null,{"$f":"IF('BİLGİ GİRİŞİ'!AR121=\"\",\"\",'BİLGİ GİRİŞİ'!AR121)","v":""},null,null,null,{"$f":"IF('BİLGİ GİRİŞİ'!AV121=\"\",\"\",'BİLGİ GİRİŞİ'!AV121)","v":""}]
[{"$f":"IF('BİLGİ GİRİŞİ'!D55=\"\",\"\",'BİLGİ GİRİŞİ'!D55)","v":""},{"$f":"IF('BİLGİ GİRİŞİ'!E55=\"\",\"\",'BİLGİ GİRİŞİ'!E55)","v":""},null,null,null,null,null,null,null,null,null,null,null,null,null,{"$f":"IF('BİLGİ GİRİŞİ'!W55=\"\",\"\",'BİLGİ GİRİŞİ'!W55)","v":""},null,null,null,{"$f":"IF('BİLGİ GİRİŞİ'!T55=\"\",\"\",'BİLGİ GİRİŞİ'!T55)","v":""},null,null,null,{"$f":"IF('BİLGİ GİRİŞİ'!AB122=\"\",\"\",'BİLGİ GİRİŞİ'!AB122)","v":""},null,null,null,{"$f":"IF('BİLGİ GİRİŞİ'!AF122=\"\",\"\",'BİLGİ GİRİŞİ'!AF122)","v":""},null,null,null,{"$f":"IF('BİLGİ GİRİŞİ'!AJ122=\"\",\"\",'BİLGİ GİRİŞİ'!AJ122)","v":""},null,null,null,{"$f":"IF('BİLGİ GİRİŞİ'!AN122=\"\",\"\",'BİLGİ GİRİŞİ'!AN122)","v":""},null,null,null,{"$f":"IF('BİLGİ GİRİŞİ'!AR122=\"\",\"\",'BİLGİ GİRİŞİ'!AR122)","v":""},null,null,null,{"$f":"IF('BİLGİ GİRİŞİ'!AV122=\"\",\"\",'BİLGİ GİRİŞİ'!AV122)","v":""}]
[{"$f":"IF('BİLGİ GİRİŞİ'!D56=\"\",\"\",'BİLGİ GİRİŞİ'!D56)","v":""},{"$f":"IF('BİLGİ GİRİŞİ'!E56=\"\",\"\",'BİLGİ GİRİŞİ'!E56)","v":""},null,null,null,null,null,null,null,null,null,null,null,null,null,{"$f":"IF('BİLGİ GİRİŞİ'!W56=\"\",\"\",'BİLGİ GİRİŞİ'!W56)","v":""},null,null,null,{"$f":"IF('BİLGİ GİRİŞİ'!T56=\"\",\"\",'BİLGİ GİRİŞİ'!T56)","v":""},null,null,null,{"$f":"IF('BİLGİ GİRİŞİ'!AB123=\"\",\"\",'BİLGİ GİRİŞİ'!AB123)","v":""},null,null,null,{"$f":"IF('BİLGİ GİRİŞİ'!AF123=\"\",\"\",'BİLGİ GİRİŞİ'!AF123)","v":""},null,null,null,{"$f":"IF('BİLGİ GİRİŞİ'!AJ123=\"\",\"\",'BİLGİ GİRİŞİ'!AJ123)","v":""},null,null,null,{"$f":"IF('BİLGİ GİRİŞİ'!AN123=\"\",\"\",'BİLGİ GİRİŞİ'!AN123)","v":""},null,null,null,{"$f":"IF('BİLGİ GİRİŞİ'!AR123=\"\",\"\",'BİLGİ GİRİŞİ'!AR123)","v":""},null,null,null,{"$f":"IF('BİLGİ GİRİŞİ'!AV123=\"\",\"\",'BİLGİ GİRİŞİ'!AV123)","v":""}]
[{"$f":"IF('BİLGİ GİRİŞİ'!D57=\"\",\"\",'BİLGİ GİRİŞİ'!D57)","v":""},{"$f":"IF('BİLGİ GİRİŞİ'!E57=\"\",\"\",'BİLGİ GİRİŞİ'!E57)","v":""},null,null,null,null,null,null,null,null,null,null,null,null,null,{"$f":"IF('BİLGİ GİRİŞİ'!W57=\"\",\"\",'BİLGİ GİRİŞİ'!W57)","v":""},null,null,null,{"$f":"IF('BİLGİ GİRİŞİ'!T57=\"\",\"\",'BİLGİ GİRİŞİ'!T57)","v":""},null,null,null,{"$f":"IF('BİLGİ GİRİŞİ'!AB124=\"\",\"\",'BİLGİ GİRİŞİ'!AB124)","v":""},null,null,null,{"$f":"IF('BİLGİ GİRİŞİ'!AF124=\"\",\"\",'BİLGİ GİRİŞİ'!AF124)","v":""},null,null,null,{"$f":"IF('BİLGİ GİRİŞİ'!AJ124=\"\",\"\",'BİLGİ GİRİŞİ'!AJ124)","v":""},null,null,null,{"$f":"IF('BİLGİ GİRİŞİ'!AN124=\"\",\"\",'BİLGİ GİRİŞİ'!AN124)","v":""},null,null,null,{"$f":"IF('BİLGİ GİRİŞİ'!AR124=\"\",\"\",'BİLGİ GİRİŞİ'!AR124)","v":""},null,null,null,{"$f":"IF('BİLGİ GİRİŞİ'!AV124=\"\",\"\",'BİLGİ GİRİŞİ'!AV124)","v":""}]
[{"$f":"IF('BİLGİ GİRİŞİ'!D58=\"\",\"\",'BİLGİ GİRİŞİ'!D58)","v":""},{"$f":"IF('BİLGİ GİRİŞİ'!E58=\"\",\"\",'BİLGİ GİRİŞİ'!E58)","v":""},null,null,null,null,null,null,null,null,null,null,null,null,null,{"$f":"IF('BİLGİ GİRİŞİ'!W58=\"\",\"\",'BİLGİ GİRİŞİ'!W58)","v":""},null,null,null,{"$f":"IF('BİLGİ GİRİŞİ'!T58=\"\",\"\",'BİLGİ GİRİŞİ'!T58)","v":""},null,null,null,{"$f":"IF('BİLGİ GİRİŞİ'!AB125=\"\",\"\",'BİLGİ GİRİŞİ'!AB125)","v":""},null,null,null,{"$f":"IF('BİLGİ GİRİŞİ'!AF125=\"\",\"\",'BİLGİ GİRİŞİ'!AF125)","v":""},null,null,null,{"$f":"IF('BİLGİ GİRİŞİ'!AJ125=\"\",\"\",'BİLGİ GİRİŞİ'!AJ125)","v":""},null,null,null,{"$f":"IF('BİLGİ GİRİŞİ'!AN125=\"\",\"\",'BİLGİ GİRİŞİ'!AN125)","v":""},null,null,null,{"$f":"IF('BİLGİ GİRİŞİ'!AR125=\"\",\"\",'BİLGİ GİRİŞİ'!AR125)","v":""},null,null,null,{"$f":"IF('BİLGİ GİRİŞİ'!AV125=\"\",\"\",'BİLGİ GİRİŞİ'!AV125)","v":""}]
[{"$f":"IF('BİLGİ GİRİŞİ'!D59=\"\",\"\",'BİLGİ GİRİŞİ'!D59)","v":""},{"$f":"IF('BİLGİ GİRİŞİ'!E59=\"\",\"\",'BİLGİ GİRİŞİ'!E59)","v":""},null,null,null,null,null,null,null,null,null,null,null,null,null,{"$f":"IF('BİLGİ GİRİŞİ'!W59=\"\",\"\",'BİLGİ GİRİŞİ'!W59)","v":""},null,null,null,{"$f":"IF('BİLGİ GİRİŞİ'!T59=\"\",\"\",'BİLGİ GİRİŞİ'!T59)","v":""},null,null,null,{"$f":"IF('BİLGİ GİRİŞİ'!AB126=\"\",\"\",'BİLGİ GİRİŞİ'!AB126)","v":""},null,null,null,{"$f":"IF('BİLGİ GİRİŞİ'!AF126=\"\",\"\",'BİLGİ GİRİŞİ'!AF126)","v":""},null,null,null,{"$f":"IF('BİLGİ GİRİŞİ'!AJ126=\"\",\"\",'BİLGİ GİRİŞİ'!AJ126)","v":""},null,null,null,{"$f":"IF('BİLGİ GİRİŞİ'!AN126=\"\",\"\",'BİLGİ GİRİŞİ'!AN126)","v":""},null,null,null,{"$f":"IF('BİLGİ GİRİŞİ'!AR126=\"\",\"\",'BİLGİ GİRİŞİ'!AR126)","v":""},null,null,null,{"$f":"IF('BİLGİ GİRİŞİ'!AV126=\"\",\"\",'BİLGİ GİRİŞİ'!AV126)","v":""}]
[{"$f":"IF('BİLGİ GİRİŞİ'!D60=\"\",\"\",'BİLGİ GİRİŞİ'!D60)","v":""},{"$f":"IF('BİLGİ GİRİŞİ'!E60=\"\",\"\",'BİLGİ GİRİŞİ'!E60)","v":""},null,null,null,null,null,null,null,null,null,null,null,null,null,{"$f":"IF('BİLGİ GİRİŞİ'!W60=\"\",\"\",'BİLGİ GİRİŞİ'!W60)","v":""},null,null,null,{"$f":"IF('BİLGİ GİRİŞİ'!T60=\"\",\"\",'BİLGİ GİRİŞİ'!T60)","v":""},null,null,null,{"$f":"IF('BİLGİ GİRİŞİ'!AB127=\"\",\"\",'BİLGİ GİRİŞİ'!AB127)","v":""},null,null,null,{"$f":"IF('BİLGİ GİRİŞİ'!AF127=\"\",\"\",'BİLGİ GİRİŞİ'!AF127)","v":""},null,null,null,{"$f":"IF('BİLGİ GİRİŞİ'!AJ127=\"\",\"\",'BİLGİ GİRİŞİ'!AJ127)","v":""},null,null,null,{"$f":"IF('BİLGİ GİRİŞİ'!AN127=\"\",\"\",'BİLGİ GİRİŞİ'!AN127)","v":""},null,null,null,{"$f":"IF('BİLGİ GİRİŞİ'!AR127=\"\",\"\",'BİLGİ GİRİŞİ'!AR127)","v":""},null,null,null,{"$f":"IF('BİLGİ GİRİŞİ'!AV127=\"\",\"\",'BİLGİ GİRİŞİ'!AV127)","v":""}]
[{"$f":"IF('BİLGİ GİRİŞİ'!D61=\"\",\"\",'BİLGİ GİRİŞİ'!D61)","v":""},{"$f":"IF('BİLGİ GİRİŞİ'!E61=\"\",\"\",'BİLGİ GİRİŞİ'!E61)","v":""},null,null,null,null,null,null,null,null,null,null,null,null,null,{"$f":"IF('BİLGİ GİRİŞİ'!W61=\"\",\"\",'BİLGİ GİRİŞİ'!W61)","v":""},null,null,null,{"$f":"IF('BİLGİ GİRİŞİ'!T61=\"\",\"\",'BİLGİ GİRİŞİ'!T61)","v":""},null,null,null,{"$f":"IF('BİLGİ GİRİŞİ'!AB128=\"\",\"\",'BİLGİ GİRİŞİ'!AB128)","v":""},null,null,null,{"$f":"IF('BİLGİ GİRİŞİ'!AF128=\"\",\"\",'BİLGİ GİRİŞİ'!AF128)","v":""},null,null,null,{"$f":"IF('BİLGİ GİRİŞİ'!AJ128=\"\",\"\",'BİLGİ GİRİŞİ'!AJ128)","v":""},null,null,null,{"$f":"IF('BİLGİ GİRİŞİ'!AN128=\"\",\"\",'BİLGİ GİRİŞİ'!AN128)","v":""},null,null,null,{"$f":"IF('BİLGİ GİRİŞİ'!AR128=\"\",\"\",'BİLGİ GİRİŞİ'!AR128)","v":""},null,null,null,{"$f":"IF('BİLGİ GİRİŞİ'!AV128=\"\",\"\",'BİLGİ GİRİŞİ'!AV128)","v":""}]
[{"$f":"IF('BİLGİ GİRİŞİ'!D62=\"\",\"\",'BİLGİ GİRİŞİ'!D62)","v":""},{"$f":"IF('BİLGİ GİRİŞİ'!E62=\"\",\"\",'BİLGİ GİRİŞİ'!E62)","v":""},null,null,null,null,null,null,null,null,null,null,null,null,null,{"$f":"IF('BİLGİ GİRİŞİ'!W62=\"\",\"\",'BİLGİ GİRİŞİ'!W62)","v":""},null,null,null,{"$f":"IF('BİLGİ GİRİŞİ'!T62=\"\",\"\",'BİLGİ GİRİŞİ'!T62)","v":""},null,null,null,{"$f":"IF('BİLGİ GİRİŞİ'!AB129=\"\",\"\",'BİLGİ GİRİŞİ'!AB129)","v":""},null,null,null,{"$f":"IF('BİLGİ GİRİŞİ'!AF129=\"\",\"\",'BİLGİ GİRİŞİ'!AF129)","v":""},null,null,null,{"$f":"IF('BİLGİ GİRİŞİ'!AJ129=\"\",\"\",'BİLGİ GİRİŞİ'!AJ129)","v":""},null,null,null,{"$f":"IF('BİLGİ GİRİŞİ'!AN129=\"\",\"\",'BİLGİ GİRİŞİ'!AN129)","v":""},null,null,null,{"$f":"IF('BİLGİ GİRİŞİ'!AR129=\"\",\"\",'BİLGİ GİRİŞİ'!AR129)","v":""},null,null,null,{"$f":"IF('BİLGİ GİRİŞİ'!AV129=\"\",\"\",'BİLGİ GİRİŞİ'!AV129)","v":""}]
[{"$f":"IF('BİLGİ GİRİŞİ'!D63=\"\",\"\",'BİLGİ GİRİŞİ'!D63)","v":""},{"$f":"IF('BİLGİ GİRİŞİ'!E63=\"\",\"\",'BİLGİ GİRİŞİ'!E63)","v":""},null,null,null,null,null,null,null,null,null,null,null,null,null,{"$f":"IF('BİLGİ GİRİŞİ'!W63=\"\",\"\",'BİLGİ GİRİŞİ'!W63)","v":""},null,null,null,{"$f":"IF('BİLGİ GİRİŞİ'!T63=\"\",\"\",'BİLGİ GİRİŞİ'!T63)","v":""},null,null,null,{"$f":"IF('BİLGİ GİRİŞİ'!AB130=\"\",\"\",'BİLGİ GİRİŞİ'!AB130)","v":""},null,null,null,{"$f":"IF('BİLGİ GİRİŞİ'!AF130=\"\",\"\",'BİLGİ GİRİŞİ'!AF130)","v":""},null,null,null,{"$f":"IF('BİLGİ GİRİŞİ'!AJ130=\"\",\"\",'BİLGİ GİRİŞİ'!AJ130)","v":""},null,null,null,{"$f":"IF('BİLGİ GİRİŞİ'!AN130=\"\",\"\",'BİLGİ GİRİŞİ'!AN130)","v":""},null,null,null,{"$f":"IF('BİLGİ GİRİŞİ'!AR130=\"\",\"\",'BİLGİ GİRİŞİ'!AR130)","v":""},null,null,null,{"$f":"IF('BİLGİ GİRİŞİ'!AV130=\"\",\"\",'BİLGİ GİRİŞİ'!AV130)","v":""}]
[{"$f":"IF('BİLGİ GİRİŞİ'!D64=\"\",\"\",'BİLGİ GİRİŞİ'!D64)","v":""},{"$f":"IF('BİLGİ GİRİŞİ'!E64=\"\",\"\",'BİLGİ GİRİŞİ'!E64)","v":""},null,null,null,null,null,null,null,null,null,null,null,null,null,{"$f":"IF('BİLGİ GİRİŞİ'!W64=\"\",\"\",'BİLGİ GİRİŞİ'!W64)","v":""},null,null,null,{"$f":"IF('BİLGİ GİRİŞİ'!T64=\"\",\"\",'BİLGİ GİRİŞİ'!T64)","v":""},null,null,null,{"$f":"IF('BİLGİ GİRİŞİ'!AB131=\"\",\"\",'BİLGİ GİRİŞİ'!AB131)","v":""},null,null,null,{"$f":"IF('BİLGİ GİRİŞİ'!AF131=\"\",\"\",'BİLGİ GİRİŞİ'!AF131)","v":""},null,null,null,{"$f":"IF('BİLGİ GİRİŞİ'!AJ131=\"\",\"\",'BİLGİ GİRİŞİ'!AJ131)","v":""},null,null,null,{"$f":"IF('BİLGİ GİRİŞİ'!AN131=\"\",\"\",'BİLGİ GİRİŞİ'!AN131)","v":""},null,null,null,{"$f":"IF('BİLGİ GİRİŞİ'!AR131=\"\",\"\",'BİLGİ GİRİŞİ'!AR131)","v":""},null,null,null,{"$f":"IF('BİLGİ GİRİŞİ'!AV131=\"\",\"\",'BİLGİ GİRİŞİ'!AV131)","v":""}]
[{"$f":"IF('BİLGİ GİRİŞİ'!D65=\"\",\"\",'BİLGİ GİRİŞİ'!D65)","v":""},{"$f":"IF('BİLGİ GİRİŞİ'!E65=\"\",\"\",'BİLGİ GİRİŞİ'!E65)","v":""},null,null,null,null,null,null,null,null,null,null,null,null,null,{"$f":"IF('BİLGİ GİRİŞİ'!W65=\"\",\"\",'BİLGİ GİRİŞİ'!W65)","v":""},null,null,null,{"$f":"IF('BİLGİ GİRİŞİ'!T65=\"\",\"\",'BİLGİ GİRİŞİ'!T65)","v":""},null,null,null,{"$f":"IF('BİLGİ GİRİŞİ'!AB132=\"\",\"\",'BİLGİ GİRİŞİ'!AB132)","v":""},null,null,null,{"$f":"IF('BİLGİ GİRİŞİ'!AF132=\"\",\"\",'BİLGİ GİRİŞİ'!AF132)","v":""},null,null,null,{"$f":"IF('BİLGİ GİRİŞİ'!AJ132=\"\",\"\",'BİLGİ GİRİŞİ'!AJ132)","v":""},null,null,null,{"$f":"IF('BİLGİ GİRİŞİ'!AN132=\"\",\"\",'BİLGİ GİRİŞİ'!AN132)","v":""},null,null,null,{"$f":"IF('BİLGİ GİRİŞİ'!AR132=\"\",\"\",'BİLGİ GİRİŞİ'!AR132)","v":""},null,null,null,{"$f":"IF('BİLGİ GİRİŞİ'!AV132=\"\",\"\",'BİLGİ GİRİŞİ'!AV132)","v":""}]
[{"$f":"IF('BİLGİ GİRİŞİ'!D66=\"\",\"\",'BİLGİ GİRİŞİ'!D66)","v":""},{"$f":"IF('BİLGİ GİRİŞİ'!E66=\"\",\"\",'BİLGİ GİRİŞİ'!E66)","v":""},null,null,null,null,null,null,null,null,null,null,null,null,null,{"$f":"IF('BİLGİ GİRİŞİ'!W66=\"\",\"\",'BİLGİ GİRİŞİ'!W66)","v":""},null,null,null,{"$f":"IF('BİLGİ GİRİŞİ'!T66=\"\",\"\",'BİLGİ GİRİŞİ'!T66)","v":""},null,null,null,{"$f":"IF('BİLGİ GİRİŞİ'!AB133=\"\",\"\",'BİLGİ GİRİŞİ'!AB133)","v":""},null,null,null,{"$f":"IF('BİLGİ GİRİŞİ'!AF133=\"\",\"\",'BİLGİ GİRİŞİ'!AF133)","v":""},null,null,null,{"$f":"IF('BİLGİ GİRİŞİ'!AJ133=\"\",\"\",'BİLGİ GİRİŞİ'!AJ133)","v":""},null,null,null,{"$f":"IF('BİLGİ GİRİŞİ'!AN133=\"\",\"\",'BİLGİ GİRİŞİ'!AN133)","v":""},null,null,null,{"$f":"IF('BİLGİ GİRİŞİ'!AR133=\"\",\"\",'BİLGİ GİRİŞİ'!AR133)","v":""},null,null,null,{"$f":"IF('BİLGİ GİRİŞİ'!AV133=\"\",\"\",'BİLGİ GİRİŞİ'!AV133)","v":""}]
[{"$f":"IF('BİLGİ GİRİŞİ'!D67=\"\",\"\",'BİLGİ GİRİŞİ'!D67)","v":""},{"$f":"IF('BİLGİ GİRİŞİ'!E67=\"\",\"\",'BİLGİ GİRİŞİ'!E67)","v":""},null,null,null,null,null,null,null,null,null,null,null,null,null,{"$f":"IF('BİLGİ GİRİŞİ'!W67=\"\",\"\",'BİLGİ GİRİŞİ'!W67)","v":""},null,null,null,{"$f":"IF('BİLGİ GİRİŞİ'!T67=\"\",\"\",'BİLGİ GİRİŞİ'!T67)","v":""},null,null,null,{"$f":"IF('BİLGİ GİRİŞİ'!AB134=\"\",\"\",'BİLGİ GİRİŞİ'!AB134)","v":""},null,null,null,{"$f":"IF('BİLGİ GİRİŞİ'!AF134=\"\",\"\",'BİLGİ GİRİŞİ'!AF134)","v":""},null,null,null,{"$f":"IF('BİLGİ GİRİŞİ'!AJ134=\"\",\"\",'BİLGİ GİRİŞİ'!AJ134)","v":""},null,null,null,{"$f":"IF('BİLGİ GİRİŞİ'!AN134=\"\",\"\",'BİLGİ GİRİŞİ'!AN134)","v":""},null,null,null,{"$f":"IF('BİLGİ GİRİŞİ'!AR134=\"\",\"\",'BİLGİ GİRİŞİ'!AR134)","v":""},null,null,null,{"$f":"IF('BİLGİ GİRİŞİ'!AV134=\"\",\"\",'BİLGİ GİRİŞİ'!AV134)","v":""}]
[{"$f":"IF('BİLGİ GİRİŞİ'!D68=\"\",\"\",'BİLGİ GİRİŞİ'!D68)","v":""},{"$f":"IF('BİLGİ GİRİŞİ'!E68=\"\",\"\",'BİLGİ GİRİŞİ'!E68)","v":""},null,null,null,null,null,null,null,null,null,null,null,null,null,{"$f":"IF('BİLGİ GİRİŞİ'!W68=\"\",\"\",'BİLGİ GİRİŞİ'!W68)","v":""},null,null,null,{"$f":"IF('BİLGİ GİRİŞİ'!T68=\"\",\"\",'BİLGİ GİRİŞİ'!T68)","v":""},null,null,null,{"$f":"IF('BİLGİ GİRİŞİ'!AB135=\"\",\"\",'BİLGİ GİRİŞİ'!AB135)","v":""},null,null,null,{"$f":"IF('BİLGİ GİRİŞİ'!AF135=\"\",\"\",'BİLGİ GİRİŞİ'!AF135)","v":""},null,null,null,{"$f":"IF('BİLGİ GİRİŞİ'!AJ135=\"\",\"\",'BİLGİ GİRİŞİ'!AJ135)","v":""},null,null,null,{"$f":"IF('BİLGİ GİRİŞİ'!AN135=\"\",\"\",'BİLGİ GİRİŞİ'!AN135)","v":""},null,null,null,{"$f":"IF('BİLGİ GİRİŞİ'!AR135=\"\",\"\",'BİLGİ GİRİŞİ'!AR135)","v":""},null,null,null,{"$f":"IF('BİLGİ GİRİŞİ'!AV135=\"\",\"\",'BİLGİ GİRİŞİ'!AV135)","v":""}]
[{"$f":"IF('BİLGİ GİRİŞİ'!D69=\"\",\"\",'BİLGİ GİRİŞİ'!D69)","v":""},{"$f":"IF('BİLGİ GİRİŞİ'!E69=\"\",\"\",'BİLGİ GİRİŞİ'!E69)","v":""},null,null,null,null,null,null,null,null,null,null,null,null,null,{"$f":"IF('BİLGİ GİRİŞİ'!W69=\"\",\"\",'BİLGİ GİRİŞİ'!W69)","v":""},null,null,null,{"$f":"IF('BİLGİ GİRİŞİ'!T69=\"\",\"\",'BİLGİ GİRİŞİ'!T69)","v":""},null,null,null,{"$f":"IF('BİLGİ GİRİŞİ'!AB136=\"\",\"\",'BİLGİ GİRİŞİ'!AB136)","v":""},null,null,null,{"$f":"IF('BİLGİ GİRİŞİ'!AF136=\"\",\"\",'BİLGİ GİRİŞİ'!AF136)","v":""},null,null,null,{"$f":"IF('BİLGİ GİRİŞİ'!AJ136=\"\",\"\",'BİLGİ GİRİŞİ'!AJ136)","v":""},null,null,null,{"$f":"IF('BİLGİ GİRİŞİ'!AN136=\"\",\"\",'BİLGİ GİRİŞİ'!AN136)","v":""},null,null,null,{"$f":"IF('BİLGİ GİRİŞİ'!AR136=\"\",\"\",'BİLGİ GİRİŞİ'!AR136)","v":""},null,null,null,{"$f":"IF('BİLGİ GİRİŞİ'!AV136=\"\",\"\",'BİLGİ GİRİŞİ'!AV136)","v":""}]
[{"$f":"IF('BİLGİ GİRİŞİ'!D70=\"\",\"\",'BİLGİ GİRİŞİ'!D70)","v":""},{"$f":"IF('BİLGİ GİRİŞİ'!E70=\"\",\"\",'BİLGİ GİRİŞİ'!E70)","v":""},null,null,null,null,null,null,null,null,null,null,null,null,null,{"$f":"IF('BİLGİ GİRİŞİ'!W70=\"\",\"\",'BİLGİ GİRİŞİ'!W70)","v":""},null,null,null,{"$f":"IF('BİLGİ GİRİŞİ'!T70=\"\",\"\",'BİLGİ GİRİŞİ'!T70)","v":""},null,null,null,{"$f":"IF('BİLGİ GİRİŞİ'!AB137=\"\",\"\",'BİLGİ GİRİŞİ'!AB137)","v":""},null,null,null,{"$f":"IF('BİLGİ GİRİŞİ'!AF137=\"\",\"\",'BİLGİ GİRİŞİ'!AF137)","v":""},null,null,null,{"$f":"IF('BİLGİ GİRİŞİ'!AJ137=\"\",\"\",'BİLGİ GİRİŞİ'!AJ137)","v":""},null,null,null,{"$f":"IF('BİLGİ GİRİŞİ'!AN137=\"\",\"\",'BİLGİ GİRİŞİ'!AN137)","v":""},null,null,null,{"$f":"IF('BİLGİ GİRİŞİ'!AR137=\"\",\"\",'BİLGİ GİRİŞİ'!AR137)","v":""},null,null,null,{"$f":"IF('BİLGİ GİRİŞİ'!AV137=\"\",\"\",'BİLGİ GİRİŞİ'!AV137)","v":""}]
[{"$f":"IF('BİLGİ GİRİŞİ'!D71=\"\",\"\",'BİLGİ GİRİŞİ'!D71)","v":""},{"$f":"IF('BİLGİ GİRİŞİ'!E71=\"\",\"\",'BİLGİ GİRİŞİ'!E71)","v":""},null,null,null,null,null,null,null,null,null,null,null,null,null,{"$f":"IF('BİLGİ GİRİŞİ'!W71=\"\",\"\",'BİLGİ GİRİŞİ'!W71)","v":""},null,null,null,{"$f":"IF('BİLGİ GİRİŞİ'!T71=\"\",\"\",'BİLGİ GİRİŞİ'!T71)","v":""},null,null,null,{"$f":"IF('BİLGİ GİRİŞİ'!AB138=\"\",\"\",'BİLGİ GİRİŞİ'!AB138)","v":""},null,null,null,{"$f":"IF('BİLGİ GİRİŞİ'!AF138=\"\",\"\",'BİLGİ GİRİŞİ'!AF138)","v":""},null,null,null,{"$f":"IF('BİLGİ GİRİŞİ'!AJ138=\"\",\"\",'BİLGİ GİRİŞİ'!AJ138)","v":""},null,null,null,{"$f":"IF('BİLGİ GİRİŞİ'!AN138=\"\",\"\",'BİLGİ GİRİŞİ'!AN138)","v":""},null,null,null,{"$f":"IF('BİLGİ GİRİŞİ'!AR138=\"\",\"\",'BİLGİ GİRİŞİ'!AR138)","v":""},null,null,null,{"$f":"IF('BİLGİ GİRİŞİ'!AV138=\"\",\"\",'BİLGİ GİRİŞİ'!AV138)","v":""}]
[{"$f":"IF('BİLGİ GİRİŞİ'!D72=\"\",\"\",'BİLGİ GİRİŞİ'!D72)","v":""},{"$f":"IF('BİLGİ GİRİŞİ'!E72=\"\",\"\",'BİLGİ GİRİŞİ'!E72)","v":""},null,null,null,null,null,null,null,null,null,null,null,null,null,{"$f":"IF('BİLGİ GİRİŞİ'!W72=\"\",\"\",'BİLGİ GİRİŞİ'!W72)","v":""},null,null,null,{"$f":"IF('BİLGİ GİRİŞİ'!T72=\"\",\"\",'BİLGİ GİRİŞİ'!T72)","v":""},null,null,null,{"$f":"IF('BİLGİ GİRİŞİ'!AB139=\"\",\"\",'BİLGİ GİRİŞİ'!AB139)","v":""},null,null,null,{"$f":"IF('BİLGİ GİRİŞİ'!AF139=\"\",\"\",'BİLGİ GİRİŞİ'!AF139)","v":""},null,null,null,{"$f":"IF('BİLGİ GİRİŞİ'!AJ139=\"\",\"\",'BİLGİ GİRİŞİ'!AJ139)","v":""},null,null,null,{"$f":"IF('BİLGİ GİRİŞİ'!AN139=\"\",\"\",'BİLGİ GİRİŞİ'!AN139)","v":""},null,null,null,{"$f":"IF('BİLGİ GİRİŞİ'!AR139=\"\",\"\",'BİLGİ GİRİŞİ'!AR139)","v":""},null,null,null,{"$f":"IF('BİLGİ GİRİŞİ'!AV139=\"\",\"\",'BİLGİ GİRİŞİ'!AV139)","v":""}]
[{"$f":"IF('BİLGİ GİRİŞİ'!D73=\"\",\"\",'BİLGİ GİRİŞİ'!D73)","v":""},{"$f":"IF('BİLGİ GİRİŞİ'!E73=\"\",\"\",'BİLGİ GİRİŞİ'!E73)","v":""},null,null,null,null,null,null,null,null,null,null,null,null,null,{"$f":"IF('BİLGİ GİRİŞİ'!W73=\"\",\"\",'BİLGİ GİRİŞİ'!W73)","v":""},null,null,null,{"$f":"IF('BİLGİ GİRİŞİ'!T73=\"\",\"\",'BİLGİ GİRİŞİ'!T73)","v":""},null,null,null,{"$f":"IF('BİLGİ GİRİŞİ'!AB140=\"\",\"\",'BİLGİ GİRİŞİ'!AB140)","v":""},null,null,null,{"$f":"IF('BİLGİ GİRİŞİ'!AF140=\"\",\"\",'BİLGİ GİRİŞİ'!AF140)","v":""},null,null,null,{"$f":"IF('BİLGİ GİRİŞİ'!AJ140=\"\",\"\",'BİLGİ GİRİŞİ'!AJ140)","v":""},null,null,null,{"$f":"IF('BİLGİ GİRİŞİ'!AN140=\"\",\"\",'BİLGİ GİRİŞİ'!AN140)","v":""},null,null,null,{"$f":"IF('BİLGİ GİRİŞİ'!AR140=\"\",\"\",'BİLGİ GİRİŞİ'!AR140)","v":""},null,null,null,{"$f":"IF('BİLGİ GİRİŞİ'!AV140=\"\",\"\",'BİLGİ GİRİŞİ'!AV140)","v":""}]
[{"$f":"IF('BİLGİ GİRİŞİ'!D74=\"\",\"\",'BİLGİ GİRİŞİ'!D74)","v":""},{"$f":"IF('BİLGİ GİRİŞİ'!E74=\"\",\"\",'BİLGİ GİRİŞİ'!E74)","v":""},null,null,null,null,null,null,null,null,null,null,null,null,null,{"$f":"IF('BİLGİ GİRİŞİ'!W74=\"\",\"\",'BİLGİ GİRİŞİ'!W74)","v":""},null,null,null,{"$f":"IF('BİLGİ GİRİŞİ'!T74=\"\",\"\",'BİLGİ GİRİŞİ'!T74)","v":""},null,null,null,{"$f":"IF('BİLGİ GİRİŞİ'!AB141=\"\",\"\",'BİLGİ GİRİŞİ'!AB141)","v":""},null,null,null,{"$f":"IF('BİLGİ GİRİŞİ'!AF141=\"\",\"\",'BİLGİ GİRİŞİ'!AF141)","v":""},null,null,null,{"$f":"IF('BİLGİ GİRİŞİ'!AJ141=\"\",\"\",'BİLGİ GİRİŞİ'!AJ141)","v":""},null,null,null,{"$f":"IF('BİLGİ GİRİŞİ'!AN141=\"\",\"\",'BİLGİ GİRİŞİ'!AN141)","v":""},null,null,null,{"$f":"IF('BİLGİ GİRİŞİ'!AR141=\"\",\"\",'BİLGİ GİRİŞİ'!AR141)","v":""},null,null,null,{"$f":"IF('BİLGİ GİRİŞİ'!AV141=\"\",\"\",'BİLGİ GİRİŞİ'!AV141)","v":""}]
[{"$f":"IF('BİLGİ GİRİŞİ'!D75=\"\",\"\",'BİLGİ GİRİŞİ'!D75)","v":""},{"$f":"IF('BİLGİ GİRİŞİ'!E75=\"\",\"\",'BİLGİ GİRİŞİ'!E75)","v":""},null,null,null,null,null,null,null,null,null,null,null,null,null,{"$f":"IF('BİLGİ GİRİŞİ'!W75=\"\",\"\",'BİLGİ GİRİŞİ'!W75)","v":""},null,null,null,{"$f":"IF('BİLGİ GİRİŞİ'!T75=\"\",\"\",'BİLGİ GİRİŞİ'!T75)","v":""},null,null,null,{"$f":"IF('BİLGİ GİRİŞİ'!AB142=\"\",\"\",'BİLGİ GİRİŞİ'!AB142)","v":""},null,null,null,{"$f":"IF('BİLGİ GİRİŞİ'!AF142=\"\",\"\",'BİLGİ GİRİŞİ'!AF142)","v":""},null,null,null,{"$f":"IF('BİLGİ GİRİŞİ'!AJ142=\"\",\"\",'BİLGİ GİRİŞİ'!AJ142)","v":""},null,null,null,{"$f":"IF('BİLGİ GİRİŞİ'!AN142=\"\",\"\",'BİLGİ GİRİŞİ'!AN142)","v":""},null,null,null,{"$f":"IF('BİLGİ GİRİŞİ'!AR142=\"\",\"\",'BİLGİ GİRİŞİ'!AR142)","v":""},null,null,null,{"$f":"IF('BİLGİ GİRİŞİ'!AV142=\"\",\"\",'BİLGİ GİRİŞİ'!AV142)","v":""}]
[{"$f":"IF('BİLGİ GİRİŞİ'!D76=\"\",\"\",'BİLGİ GİRİŞİ'!D76)","v":""},{"$f":"IF('BİLGİ GİRİŞİ'!E76=\"\",\"\",'BİLGİ GİRİŞİ'!E76)","v":""},null,null,null,null,null,null,null,null,null,null,null,null,null,{"$f":"IF('BİLGİ GİRİŞİ'!W76=\"\",\"\",'BİLGİ GİRİŞİ'!W76)","v":""},null,null,null,{"$f":"IF('BİLGİ GİRİŞİ'!T76=\"\",\"\",'BİLGİ GİRİŞİ'!T76)","v":""},null,null,null,{"$f":"IF('BİLGİ GİRİŞİ'!AB143=\"\",\"\",'BİLGİ GİRİŞİ'!AB143)","v":""},null,null,null,{"$f":"IF('BİLGİ GİRİŞİ'!AF143=\"\",\"\",'BİLGİ GİRİŞİ'!AF143)","v":""},null,null,null,{"$f":"IF('BİLGİ GİRİŞİ'!AJ143=\"\",\"\",'BİLGİ GİRİŞİ'!AJ143)","v":""},null,null,null,{"$f":"IF('BİLGİ GİRİŞİ'!AN143=\"\",\"\",'BİLGİ GİRİŞİ'!AN143)","v":""},null,null,null,{"$f":"IF('BİLGİ GİRİŞİ'!AR143=\"\",\"\",'BİLGİ GİRİŞİ'!AR143)","v":""},null,null,null,{"$f":"IF('BİLGİ GİRİŞİ'!AV143=\"\",\"\",'BİLGİ GİRİŞİ'!AV143)","v":""}]
[{"$f":"IF('BİLGİ GİRİŞİ'!D77=\"\",\"\",'BİLGİ GİRİŞİ'!D77)","v":""},{"$f":"IF('BİLGİ GİRİŞİ'!E77=\"\",\"\",'BİLGİ GİRİŞİ'!E77)","v":""},null,null,null,null,null,null,null,null,null,null,null,null,null,{"$f":"IF('BİLGİ GİRİŞİ'!W77=\"\",\"\",'BİLGİ GİRİŞİ'!W77)","v":""},null,null,null,{"$f":"IF('BİLGİ GİRİŞİ'!T77=\"\",\"\",'BİLGİ GİRİŞİ'!T77)","v":""},null,null,null,{"$f":"IF('BİLGİ GİRİŞİ'!AB144=\"\",\"\",'BİLGİ GİRİŞİ'!AB144)","v":""},null,null,null,{"$f":"IF('BİLGİ GİRİŞİ'!AF144=\"\",\"\",'BİLGİ GİRİŞİ'!AF144)","v":""},null,null,null,{"$f":"IF('BİLGİ GİRİŞİ'!AJ144=\"\",\"\",'BİLGİ GİRİŞİ'!AJ144)","v":""},null,null,null,{"$f":"IF('BİLGİ GİRİŞİ'!AN144=\"\",\"\",'BİLGİ GİRİŞİ'!AN144)","v":""},null,null,null,{"$f":"IF('BİLGİ GİRİŞİ'!AR144=\"\",\"\",'BİLGİ GİRİŞİ'!AR144)","v":""},null,null,null,{"$f":"IF('BİLGİ GİRİŞİ'!AV144=\"\",\"\",'BİLGİ GİRİŞİ'!AV144)","v":""}]
[{"$f":"IF('BİLGİ GİRİŞİ'!D78=\"\",\"\",'BİLGİ GİRİŞİ'!D78)","v":""},{"$f":"IF('BİLGİ GİRİŞİ'!E78=\"\",\"\",'BİLGİ GİRİŞİ'!E78)","v":""},null,null,null,null,null,null,null,null,null,null,null,null,null,{"$f":"IF('BİLGİ GİRİŞİ'!W78=\"\",\"\",'BİLGİ GİRİŞİ'!W78)","v":""},null,null,null,{"$f":"IF('BİLGİ GİRİŞİ'!T78=\"\",\"\",'BİLGİ GİRİŞİ'!T78)","v":""},null,null,null,{"$f":"IF('BİLGİ GİRİŞİ'!AB145=\"\",\"\",'BİLGİ GİRİŞİ'!AB145)","v":""},null,null,null,{"$f":"IF('BİLGİ GİRİŞİ'!AF145=\"\",\"\",'BİLGİ GİRİŞİ'!AF145)","v":""},null,null,null,{"$f":"IF('BİLGİ GİRİŞİ'!AJ145=\"\",\"\",'BİLGİ GİRİŞİ'!AJ145)","v":""},null,null,null,{"$f":"IF('BİLGİ GİRİŞİ'!AN145=\"\",\"\",'BİLGİ GİRİŞİ'!AN145)","v":""},null,null,null,{"$f":"IF('BİLGİ GİRİŞİ'!AR145=\"\",\"\",'BİLGİ GİRİŞİ'!AR145)","v":""},null,null,null,{"$f":"IF('BİLGİ GİRİŞİ'!AV145=\"\",\"\",'BİLGİ GİRİŞİ'!AV145)","v":""}]
[{"$f":"IF('BİLGİ GİRİŞİ'!D79=\"\",\"\",'BİLGİ GİRİŞİ'!D79)","v":""},{"$f":"IF('BİLGİ GİRİŞİ'!E79=\"\",\"\",'BİLGİ GİRİŞİ'!E79)","v":""},null,null,null,null,null,null,null,null,null,null,null,null,null,{"$f":"IF('BİLGİ GİRİŞİ'!W79=\"\",\"\",'BİLGİ GİRİŞİ'!W79)","v":""},null,null,null,{"$f":"IF('BİLGİ GİRİŞİ'!T79=\"\",\"\",'BİLGİ GİRİŞİ'!T79)","v":""},null,null,null,{"$f":"IF('BİLGİ GİRİŞİ'!AB146=\"\",\"\",'BİLGİ GİRİŞİ'!AB146)","v":""},null,null,null,{"$f":"IF('BİLGİ GİRİŞİ'!AF146=\"\",\"\",'BİLGİ GİRİŞİ'!AF146)","v":""},null,null,null,{"$f":"IF('BİLGİ GİRİŞİ'!AJ146=\"\",\"\",'BİLGİ GİRİŞİ'!AJ146)","v":""},null,null,null,{"$f":"IF('BİLGİ GİRİŞİ'!AN146=\"\",\"\",'BİLGİ GİRİŞİ'!AN146)","v":""},null,null,null,{"$f":"IF('BİLGİ GİRİŞİ'!AR146=\"\",\"\",'BİLGİ GİRİŞİ'!AR146)","v":""},null,null,null,{"$f":"IF('BİLGİ GİRİŞİ'!AV146=\"\",\"\",'BİLGİ GİRİŞİ'!AV146)","v":""}]
[{"$f":"IF('BİLGİ GİRİŞİ'!D80=\"\",\"\",'BİLGİ GİRİŞİ'!D80)","v":""},{"$f":"IF('BİLGİ GİRİŞİ'!E80=\"\",\"\",'BİLGİ GİRİŞİ'!E80)","v":""},null,null,null,null,null,null,null,null,null,null,null,null,null,{"$f":"IF('BİLGİ GİRİŞİ'!W80=\"\",\"\",'BİLGİ GİRİŞİ'!W80)","v":""},null,null,null,{"$f":"IF('BİLGİ GİRİŞİ'!T80=\"\",\"\",'BİLGİ GİRİŞİ'!T80)","v":""},null,null,null,{"$f":"IF('BİLGİ GİRİŞİ'!AB147=\"\",\"\",'BİLGİ GİRİŞİ'!AB147)","v":""},null,null,null,{"$f":"IF('BİLGİ GİRİŞİ'!AF147=\"\",\"\",'BİLGİ GİRİŞİ'!AF147)","v":""},null,null,null,{"$f":"IF('BİLGİ GİRİŞİ'!AJ147=\"\",\"\",'BİLGİ GİRİŞİ'!AJ147)","v":""},null,null,null,{"$f":"IF('BİLGİ GİRİŞİ'!AN147=\"\",\"\",'BİLGİ GİRİŞİ'!AN147)","v":""},null,null,null,{"$f":"IF('BİLGİ GİRİŞİ'!AR147=\"\",\"\",'BİLGİ GİRİŞİ'!AR147)","v":""},null,null,null,{"$f":"IF('BİLGİ GİRİŞİ'!AV147=\"\",\"\",'BİLGİ GİRİŞİ'!AV147)","v":""}]
[{"$f":"IF('BİLGİ GİRİŞİ'!D81=\"\",\"\",'BİLGİ GİRİŞİ'!D81)","v":""},{"$f":"IF('BİLGİ GİRİŞİ'!E81=\"\",\"\",'BİLGİ GİRİŞİ'!E81)","v":""},null,null,null,null,null,null,null,null,null,null,null,null,null,{"$f":"IF('BİLGİ GİRİŞİ'!W81=\"\",\"\",'BİLGİ GİRİŞİ'!W81)","v":""},null,null,null,{"$f":"IF('BİLGİ GİRİŞİ'!T81=\"\",\"\",'BİLGİ GİRİŞİ'!T81)","v":""},null,null,null,{"$f":"IF('BİLGİ GİRİŞİ'!AB148=\"\",\"\",'BİLGİ GİRİŞİ'!AB148)","v":""},null,null,null,{"$f":"IF('BİLGİ GİRİŞİ'!AF148=\"\",\"\",'BİLGİ GİRİŞİ'!AF148)","v":""},null,null,null,{"$f":"IF('BİLGİ GİRİŞİ'!AJ148=\"\",\"\",'BİLGİ GİRİŞİ'!AJ148)","v":""},null,null,null,{"$f":"IF('BİLGİ GİRİŞİ'!AN148=\"\",\"\",'BİLGİ GİRİŞİ'!AN148)","v":""},null,null,null,{"$f":"IF('BİLGİ GİRİŞİ'!AR148=\"\",\"\",'BİLGİ GİRİŞİ'!AR148)","v":""},null,null,null,{"$f":"IF('BİLGİ GİRİŞİ'!AV148=\"\",\"\",'BİLGİ GİRİŞİ'!AV148)","v":""}]
[{"$f":"IF('BİLGİ GİRİŞİ'!D82=\"\",\"\",'BİLGİ GİRİŞİ'!D82)","v":""},{"$f":"IF('BİLGİ GİRİŞİ'!E82=\"\",\"\",'BİLGİ GİRİŞİ'!E82)","v":""},null,null,null,null,null,null,null,null,null,null,null,null,null,{"$f":"IF('BİLGİ GİRİŞİ'!W82=\"\",\"\",'BİLGİ GİRİŞİ'!W82)","v":""},null,null,null,{"$f":"IF('BİLGİ GİRİŞİ'!T82=\"\",\"\",'BİLGİ GİRİŞİ'!T82)","v":""},null,null,null,{"$f":"IF('BİLGİ GİRİŞİ'!AB149=\"\",\"\",'BİLGİ GİRİŞİ'!AB149)","v":""},null,null,null,{"$f":"IF('BİLGİ GİRİŞİ'!AF149=\"\",\"\",'BİLGİ GİRİŞİ'!AF149)","v":""},null,null,null,{"$f":"IF('BİLGİ GİRİŞİ'!AJ149=\"\",\"\",'BİLGİ GİRİŞİ'!AJ149)","v":""},null,null,null,{"$f":"IF('BİLGİ GİRİŞİ'!AN149=\"\",\"\",'BİLGİ GİRİŞİ'!AN149)","v":""},null,null,null,{"$f":"IF('BİLGİ GİRİŞİ'!AR149=\"\",\"\",'BİLGİ GİRİŞİ'!AR149)","v":""},null,null,null,{"$f":"IF('BİLGİ GİRİŞİ'!AV149=\"\",\"\",'BİLGİ GİRİŞİ'!AV149)","v":""}]
[{"$f":"IF('BİLGİ GİRİŞİ'!D83=\"\",\"\",'BİLGİ GİRİŞİ'!D83)","v":""},{"$f":"IF('BİLGİ GİRİŞİ'!E83=\"\",\"\",'BİLGİ GİRİŞİ'!E83)","v":""},null,null,null,null,null,null,null,null,null,null,null,null,null,{"$f":"IF('BİLGİ GİRİŞİ'!W83=\"\",\"\",'BİLGİ GİRİŞİ'!W83)","v":""},null,null,null,{"$f":"IF('BİLGİ GİRİŞİ'!T83=\"\",\"\",'BİLGİ GİRİŞİ'!T83)","v":""},null,null,null,{"$f":"IF('BİLGİ GİRİŞİ'!AB150=\"\",\"\",'BİLGİ GİRİŞİ'!AB150)","v":""},null,null,null,{"$f":"IF('BİLGİ GİRİŞİ'!AF150=\"\",\"\",'BİLGİ GİRİŞİ'!AF150)","v":""},null,null,null,{"$f":"IF('BİLGİ GİRİŞİ'!AJ150=\"\",\"\",'BİLGİ GİRİŞİ'!AJ150)","v":""},null,null,null,{"$f":"IF('BİLGİ GİRİŞİ'!AN150=\"\",\"\",'BİLGİ GİRİŞİ'!AN150)","v":""},null,null,null,{"$f":"IF('BİLGİ GİRİŞİ'!AR150=\"\",\"\",'BİLGİ GİRİŞİ'!AR150)","v":""},null,null,null,{"$f":"IF('BİLGİ GİRİŞİ'!AV150=\"\",\"\",'BİLGİ GİRİŞİ'!AV150)","v":""}]
[{"$f":"IF('BİLGİ GİRİŞİ'!D84=\"\",\"\",'BİLGİ GİRİŞİ'!D84)","v":""},{"$f":"IF('BİLGİ GİRİŞİ'!E84=\"\",\"\",'BİLGİ GİRİŞİ'!E84)","v":""},null,null,null,null,null,null,null,null,null,null,null,null,null,{"$f":"IF('BİLGİ GİRİŞİ'!W84=\"\",\"\",'BİLGİ GİRİŞİ'!W84)","v":""},null,null,null,{"$f":"IF('BİLGİ GİRİŞİ'!T84=\"\",\"\",'BİLGİ GİRİŞİ'!T84)","v":""},null,null,null,{"$f":"IF('BİLGİ GİRİŞİ'!AB151=\"\",\"\",'BİLGİ GİRİŞİ'!AB151)","v":""},null,null,null,{"$f":"IF('BİLGİ GİRİŞİ'!AF151=\"\",\"\",'BİLGİ GİRİŞİ'!AF151)","v":""},null,null,null,{"$f":"IF('BİLGİ GİRİŞİ'!AJ151=\"\",\"\",'BİLGİ GİRİŞİ'!AJ151)","v":""},null,null,null,{"$f":"IF('BİLGİ GİRİŞİ'!AN151=\"\",\"\",'BİLGİ GİRİŞİ'!AN151)","v":""},null,null,null,{"$f":"IF('BİLGİ GİRİŞİ'!AR151=\"\",\"\",'BİLGİ GİRİŞİ'!AR151)","v":""},null,null,null,{"$f":"IF('BİLGİ GİRİŞİ'!AV151=\"\",\"\",'BİLGİ GİRİŞİ'!AV151)","v":""}]
[{"$f":"IF('BİLGİ GİRİŞİ'!D85=\"\",\"\",'BİLGİ GİRİŞİ'!D85)","v":""},{"$f":"IF('BİLGİ GİRİŞİ'!E85=\"\",\"\",'BİLGİ GİRİŞİ'!E85)","v":""},null,null,null,null,null,null,null,null,null,null,null,null,null,{"$f":"IF('BİLGİ GİRİŞİ'!W85=\"\",\"\",'BİLGİ GİRİŞİ'!W85)","v":""},null,null,null,{"$f":"IF('BİLGİ GİRİŞİ'!T85=\"\",\"\",'BİLGİ GİRİŞİ'!T85)","v":""},null,null,null,{"$f":"IF('BİLGİ GİRİŞİ'!AB152=\"\",\"\",'BİLGİ GİRİŞİ'!AB152)","v":""},null,null,null,{"$f":"IF('BİLGİ GİRİŞİ'!AF152=\"\",\"\",'BİLGİ GİRİŞİ'!AF152)","v":""},null,null,null,{"$f":"IF('BİLGİ GİRİŞİ'!AJ152=\"\",\"\",'BİLGİ GİRİŞİ'!AJ152)","v":""},null,null,null,{"$f":"IF('BİLGİ GİRİŞİ'!AN152=\"\",\"\",'BİLGİ GİRİŞİ'!AN152)","v":""},null,null,null,{"$f":"IF('BİLGİ GİRİŞİ'!AR152=\"\",\"\",'BİLGİ GİRİŞİ'!AR152)","v":""},null,null,null,{"$f":"IF('BİLGİ GİRİŞİ'!AV152=\"\",\"\",'BİLGİ GİRİŞİ'!AV152)","v":""}]
[{"$f":"IF('BİLGİ GİRİŞİ'!D86=\"\",\"\",'BİLGİ GİRİŞİ'!D86)","v":""},{"$f":"IF('BİLGİ GİRİŞİ'!E86=\"\",\"\",'BİLGİ GİRİŞİ'!E86)","v":""},null,null,null,null,null,null,null,null,null,null,null,null,null,{"$f":"IF('BİLGİ GİRİŞİ'!W86=\"\",\"\",'BİLGİ GİRİŞİ'!W86)","v":""},null,null,null,{"$f":"IF('BİLGİ GİRİŞİ'!T86=\"\",\"\",'BİLGİ GİRİŞİ'!T86)","v":""},null,null,null,{"$f":"IF('BİLGİ GİRİŞİ'!AB153=\"\",\"\",'BİLGİ GİRİŞİ'!AB153)","v":""},null,null,null,{"$f":"IF('BİLGİ GİRİŞİ'!AF153=\"\",\"\",'BİLGİ GİRİŞİ'!AF153)","v":""},null,null,null,{"$f":"IF('BİLGİ GİRİŞİ'!AJ153=\"\",\"\",'BİLGİ GİRİŞİ'!AJ153)","v":""},null,null,null,{"$f":"IF('BİLGİ GİRİŞİ'!AN153=\"\",\"\",'BİLGİ GİRİŞİ'!AN153)","v":""},null,null,null,{"$f":"IF('BİLGİ GİRİŞİ'!AR153=\"\",\"\",'BİLGİ GİRİŞİ'!AR153)","v":""},null,null,null,{"$f":"IF('BİLGİ GİRİŞİ'!AV153=\"\",\"\",'BİLGİ GİRİŞİ'!AV153)","v":""}]
[{"$f":"IF('BİLGİ GİRİŞİ'!D87=\"\",\"\",'BİLGİ GİRİŞİ'!D87)","v":""},{"$f":"IF('BİLGİ GİRİŞİ'!E87=\"\",\"\",'BİLGİ GİRİŞİ'!E87)","v":""},null,null,null,null,null,null,null,null,null,null,null,null,null,{"$f":"IF('BİLGİ GİRİŞİ'!W87=\"\",\"\",'BİLGİ GİRİŞİ'!W87)","v":""},null,null,null,{"$f":"IF('BİLGİ GİRİŞİ'!T87=\"\",\"\",'BİLGİ GİRİŞİ'!T87)","v":""},null,null,null,{"$f":"IF('BİLGİ GİRİŞİ'!AB154=\"\",\"\",'BİLGİ GİRİŞİ'!AB154)","v":""},null,null,null,{"$f":"IF('BİLGİ GİRİŞİ'!AF154=\"\",\"\",'BİLGİ GİRİŞİ'!AF154)","v":""},null,null,null,{"$f":"IF('BİLGİ GİRİŞİ'!AJ154=\"\",\"\",'BİLGİ GİRİŞİ'!AJ154)","v":""},null,null,null,{"$f":"IF('BİLGİ GİRİŞİ'!AN154=\"\",\"\",'BİLGİ GİRİŞİ'!AN154)","v":""},null,null,null,{"$f":"IF('BİLGİ GİRİŞİ'!AR154=\"\",\"\",'BİLGİ GİRİŞİ'!AR154)","v":""},null,null,null,{"$f":"IF('BİLGİ GİRİŞİ'!AV154=\"\",\"\",'BİLGİ GİRİŞİ'!AV154)","v":""}]
[{"$f":"IF('BİLGİ GİRİŞİ'!D88=\"\",\"\",'BİLGİ GİRİŞİ'!D88)","v":""},{"$f":"IF('BİLGİ GİRİŞİ'!E88=\"\",\"\",'BİLGİ GİRİŞİ'!E88)","v":""},null,null,null,null,null,null,null,null,null,null,null,null,null,{"$f":"IF('BİLGİ GİRİŞİ'!W88=\"\",\"\",'BİLGİ GİRİŞİ'!W88)","v":""},null,null,null,{"$f":"IF('BİLGİ GİRİŞİ'!T88=\"\",\"\",'BİLGİ GİRİŞİ'!T88)","v":""},null,null,null,{"$f":"IF('BİLGİ GİRİŞİ'!AB155=\"\",\"\",'BİLGİ GİRİŞİ'!AB155)","v":""},null,null,null,{"$f":"IF('BİLGİ GİRİŞİ'!AF155=\"\",\"\",'BİLGİ GİRİŞİ'!AF155)","v":""},null,null,null,{"$f":"IF('BİLGİ GİRİŞİ'!AJ155=\"\",\"\",'BİLGİ GİRİŞİ'!AJ155)","v":""},null,null,null,{"$f":"IF('BİLGİ GİRİŞİ'!AN155=\"\",\"\",'BİLGİ GİRİŞİ'!AN155)","v":""},null,null,null,{"$f":"IF('BİLGİ GİRİŞİ'!AR155=\"\",\"\",'BİLGİ GİRİŞİ'!AR155)","v":""},null,null,null,{"$f":"IF('BİLGİ GİRİŞİ'!AV155=\"\",\"\",'BİLGİ GİRİŞİ'!AV155)","v":""}]
[{"$f":"IF('BİLGİ GİRİŞİ'!D89=\"\",\"\",'BİLGİ GİRİŞİ'!D89)","v":""},{"$f":"IF('BİLGİ GİRİŞİ'!E89=\"\",\"\",'BİLGİ GİRİŞİ'!E89)","v":""},null,null,null,null,null,null,null,null,null,null,null,null,null,{"$f":"IF('BİLGİ GİRİŞİ'!W89=\"\",\"\",'BİLGİ GİRİŞİ'!W89)","v":""},null,null,null,{"$f":"IF('BİLGİ GİRİŞİ'!T89=\"\",\"\",'BİLGİ GİRİŞİ'!T89)","v":""},null,null,null,{"$f":"IF('BİLGİ GİRİŞİ'!AB156=\"\",\"\",'BİLGİ GİRİŞİ'!AB156)","v":""},null,null,null,{"$f":"IF('BİLGİ GİRİŞİ'!AF156=\"\",\"\",'BİLGİ GİRİŞİ'!AF156)","v":""},null,null,null,{"$f":"IF('BİLGİ GİRİŞİ'!AJ156=\"\",\"\",'BİLGİ GİRİŞİ'!AJ156)","v":""},null,null,null,{"$f":"IF('BİLGİ GİRİŞİ'!AN156=\"\",\"\",'BİLGİ GİRİŞİ'!AN156)","v":""},null,null,null,{"$f":"IF('BİLGİ GİRİŞİ'!AR156=\"\",\"\",'BİLGİ GİRİŞİ'!AR156)","v":""},null,null,null,{"$f":"IF('BİLGİ GİRİŞİ'!AV156=\"\",\"\",'BİLGİ GİRİŞİ'!AV156)","v":""}]
["TOPLAM",null,null,null,null,null,null,null,null,null,null,null,null,null,null,null,null,null,null,null,null,null,null,{"$f":"SUM(X12:X71)","v":12000},null,null,null,{"$f":"SUM(AB12:AB71)","v":24000},null,null,null,{"$f":"SUM(AF12:AF71)","v":15000},null,null,null,{"$f":"SUM(AJ12:AJ71)","v":30000},null,null,null,{"$f":"SUM(AN12:AN71)","v":18000},null,null,null,{"$f":"SUM(AR12:AR71)","v":36000}]
[]
["EN UYGUN (DÜŞÜK) TEKLİFİ VEREN VE TEKLİFİ UYGUN GÖRÜLEN GERÇEK/TÜZEL KİŞİ"]
["ADI",null,null,null,null,null,null,null,null,null,null,null,null,null,null,null,null,null,null,null,null,null,null,"GERÇEK/TÜZEL KİŞİ'NİN ADRESİ",null,null,null,null,null,null,null,null,null,null,null,null,null,null,null,"TEKLİF ETTİĞİ FİYAT"]
[{"$f":"IF('BİLGİ GİRİŞİ'!D161=\"\",\"\",'BİLGİ GİRİŞİ'!D161)","v":"A GERÇEK/TÜZEL KİŞİSİ"},null,null,null,null,null,null,null,null,null,null,null,null,null,null,null,null,null,null,null,null,null,null,{"$f":"IF('BİLGİ GİRİŞİ'!T161=\"\",\"\",'BİLGİ GİRİŞİ'!T161)","v":"Bulanık/MUŞ"},null,null,null,null,null,null,null,null,null,null,null,null,null,null,null,{"$f":"IF('BİLGİ GİRİŞİ'!AF161=\"\",\"\",'BİLGİ GİRİŞİ'!AF161)","v":24000}]
[]
[{"$f":"CONCATENATE(\"        Kamu İhale Kanunu'nun \",IF('BİLGİ GİRİŞİ'!O10=\"\",\".............................................................................\",'BİLGİ GİRİŞİ'!O10),\" maddesine göre Doğrudan Temin yoluyla satın alınacak Mal/Hizmet/Yapım İşi'ne ilişkin yapılan piyasa araştırması sonucu gerçek/tüzel kişilerce teklif edilen fiyatlar\"&\" tarafımızca  değerlendirilmiş olup Ma'ın/Hizmet'in/Yapım İşi'nin, yukarıda bilgileri verilen ve teklifi uygun görülen gerçek/tüzel kişiden alınması uygun görülmüştür. \"& TEXT(IF('BİLGİ GİRİŞİ'!O22=\"\",\"…../…../……..\",'BİLGİ GİRİŞİ'!O22),\"gg.aa.yyyy \"))","v":"        Kamu İhale Kanunu'nun 22/d maddesine göre Doğrudan Temin yoluyla satın alınacak Mal/Hizmet/Yapım İşi'ne ilişkin yapılan piyasa araştırması sonucu gerçek/tüzel kişilerce teklif edilen fiyatlar tarafımızca  değerlendirilmiş olup Ma'ın/Hizmet'in/Yapım İşi'nin, yukarıda bilgileri verilen ve teklifi uygun görülen gerçek/tüzel kişiden alınması uygun görülmüştür. 08.03.2023 "}]
[]
[]
[]
[null,null,null,null,null,null,null,null,null,null,null,null,null,null,null,null,null,null,null,null,null,null,null,null,null,null,null,null,null,null,null,{"$f":"IF(AF86=\"\",\"\",IF('BİLGİ GİRİŞİ'!AB16=\"\",\"\",'BİLGİ GİRİŞİ'!AB16))","v":"Piyasa Araştırma Görevlisi"}]
[{"$f":"IF(A86=\"\",\"\",IF('BİLGİ GİRİŞİ'!AH16=\"\",\"\",'BİLGİ GİRİŞİ'!AH16))","v":"Piyasa Araştırma Görevlisi"},null,null,null,null,null,null,null,null,null,null,null,null,null,null,{"$f":"IF(P86=\"\",\"\",IF('BİLGİ GİRİŞİ'!AN16=\"\",\"\",'BİLGİ GİRİŞİ'!AN16))","v":""}]
[]
[]
[{"$f":"IF('BİLGİ GİRİŞİ'!AH17=\"\",\"\",'BİLGİ GİRİŞİ'!AH17)","v":"Ayşe YILDIZ"},null,null,null,null,null,null,null,null,null,null,null,null,null,null,{"$f":"IF('BİLGİ GİRİŞİ'!AN17=\"\",\"\",'BİLGİ GİRİŞİ'!AN17)","v":""},null,null,null,null,null,null,null,null,null,null,null,null,null,null,null,{"$f":"IF('BİLGİ GİRİŞİ'!AB17=\"\",\"\",'BİLGİ GİRİŞİ'!AB17)","v":"Ahmet DEMİR"}]
[{"$f":"IF('BİLGİ GİRİŞİ'!AH18=\"\",\"\",'BİLGİ GİRİŞİ'!AH18)","v":"Öğretmen 1"},null,null,null,null,null,null,null,null,null,null,null,null,null,null,{"$f":"IF(P86=\"\",\"\",IF('BİLGİ GİRİŞİ'!AN18=\"\",\"\",'BİLGİ GİRİŞİ'!AN18))","v":""},null,null,null,null,null,null,null,null,null,null,null,null,null,null,null,{"$f":"IF('BİLGİ GİRİŞİ'!AB18=\"\",\"\",'BİLGİ GİRİŞİ'!AB18)","v":"Müdür Yardımcısı 1"}]

{"sheet":"8","index":9,"n_rows":98,"n_cols":28,"rows_kept":98,"cut":false,"hidden":false,"merged":[[66,1,66,22],[66,23,66,26],[66,27,66,30],[67,1,67,22],[67,23,67,26],[67,27,67,30],[63,1,63,22],[63,23,63,26],[63,27,63,30],[64,1,64,22],[64,23,64,26],[64,27,64,30],[65,1,65,22],[65,23,65,26],[65,27,65,30],[60,1,60,22],[60,23,60,26],[60,27,60,30],[61,1,61,22],[61,23,61,26],[61,27,61,30],[62,1,62,22],[62,23,62,26],[62,27,62,30],[57,1,57,22],[57,23,57,26],[57,27,57,30],[58,1,58,22],[58,23,58,26],[58,27,58,30],[59,1,59,22],[59,23,59,26],[59,27,59,30],[54,1,54,22],[54,23,54,26],[54,27,54,30],[55,1,55,22],[55,23,55,26],[55,27,55,30],[56,1,56,22],[56,23,56,26],[56,27,56,30],[51,1,51,22],[51,23,51,26],[51,27,51,30],[52,1,52,22],[52,23,52,26],[52,27,52,30],[53,1,53,22],[53,23,53,26],[53,27,53,30],[48,1,48,22],[48,23,48,26],[48,27,48,30],[49,1,49,22],[49,23,49,26],[49,27,49,30],[50,1,50,22],[50,23,50,26],[50,27,50,30],[92,0,92,30],[94,0,94,30],[95,0,95,30],[88,0,88,9],[89,10,89,20],[89,21,89,30],[91,0,91,30],[88,10,88,19],[88,20,88,30],[79,0,82,30],[84,0,84,9],[87,0,87,9],[84,10,84,19],[87,10,87,19],[84,20,84,30],[87,20,87,30],[85,0,85,9],[85,10,85,19],[85,20,85,30],[26,1,26,22],[26,23,26,26],[26,27,26,30],[27,1,27,22],[27,23,27,26],[27,27,27,30],[68,1,68,22],[68,23,68,26],[68,27,68,30],[28,1,28,22],[29,1,29,22],[30,1,30,22],[31,1,31,22],[32,1,32,22],[33,1,33,22],[34,1,34,22],[35,1,35,22],[36,1,36,22],[37,1,37,22],[38,1,38,22],[39,1,39,22],[40,1,40,22],[41,1,41,22],[42,1,42,22],[23,1,23,22],[23,23,23,26],[23,27,23,30],[24,1,24,22],[24,23,24,26],[24,27,24,30],[25,1,25,22],[25,23,25,26],[25,27,25,30],[20,1,20,22],[20,23,20,26],[20,27,20,30],[21,1,21,22],[21,23,21,26],[21,27,21,30],[22,1,22,22],[22,23,22,26],[22,27,22,30],[17,1,17,22],[17,23,17,26],[17,27,17,30],[18,1,18,22],[18,23,18,26],[18,27,18,30],[19,1,19,22],[19,23,19,26],[19,27,19,30],[14,1,14,22],[14,23,14,26],[14,27,14,30],[15,1,15,22],[15,23,15,26],[15,27,15,30],[16,1,16,22],[16,23,16,26],[16,27,16,30],[1,0,1,9],[3,0,3,9],[4,0,4,9],[1,11,1,30],[3,11,3,30],[4,11,4,14],[4,16,4,30],[2,0,2,9],[2,11,2,30],[70,1,70,22],[70,23,70,30],[71,1,71,22],[71,23,71,30],[7,0,7,30],[8,1,8,22],[8,23,8,26],[8,27,8,30],[5,0,6,30],[9,1,9,22],[9,27,9,30],[9,23,9,26],[10,1,10,22],[10,27,10,30],[10,23,10,26],[11,1,11,22],[11,27,11,30],[11,23,11,26],[12,1,12,22],[12,23,12,26],[12,27,12,30],[13,1,13,22],[13,23,13,26],[13,27,13,30],[76,1,76,22],[76,23,76,30],[75,0,75,30],[77,1,77,22],[77,23,77,30],[72,1,72,22],[72,23,72,30],[73,1,73,22],[73,23,73,30],[43,1,43,22],[44,1,44,22],[45,1,45,22],[46,1,46,22],[47,1,47,22],[28,23,28,26],[28,27,28,30],[29,23,29,26],[29,27,29,30],[30,23,30,26],[30,27,30,30],[31,23,31,26],[31,27,31,30],[32,23,32,26],[32,27,32,30],[33,23,33,26],[33,27,33,30],[34,23,34,26],[34,27,34,30],[35,23,35,26],[35,27,35,30],[36,23,36,26],[36,27,36,30],[37,23,37,26],[37,27,37,30],[38,23,38,26],[38,27,38,30],[39,23,39,26],[39,27,39,30],[40,23,40,26],[40,27,40,30],[41,23,41,26],[41,27,41,30],[47,23,47,26],[47,27,47,30],[42,23,42,26],[42,27,42,30],[43,23,43,26],[43,27,43,30],[44,23,44,26],[44,27,44,30],[45,23,45,26],[45,27,45,30],[46,23,46,26],[46,27,46,30]]}
[]
["İdarenin Adı",null,null,null,null,null,null,null,null,null,":",{"$f":"IF('BİLGİ GİRİŞİ'!O8=\"\",\"\",'BİLGİ GİRİŞİ'!O8)","v":"Atatürk İlkokulu Müdürlüğü"}]
["Doğrudan Temin Numarası",null,null,null,null,null,null,null,null,null,":",{"$f":"IF('BİLGİ GİRİŞİ'!O11=\"\",\"\",'BİLGİ GİRİŞİ'!O11)","v":"22DT1211930"}]
["Mal/Hizmet/Yapım Adı, Niteliği ",null,null,null,null,null,null,null,null,null,":",{"$f":"IF('BİLGİ GİRİŞİ'!O9=\"\",\"\",'BİLGİ GİRİŞİ'!O9)","v":"Bilişim Malzemeleri Alımı"}]
["Alım/Görevlendirme Onay Tarihi/sayısı",null,null,null,null,null,null,null,null,null,":",{"$f":"IF('BİLGİ GİRİŞİ'!O15=\"\",\"\",'BİLGİ GİRİŞİ'!O15)","v":"2023-03-06"},null,null,null,"/",{"$f":"IF('BİLGİ GİRİŞİ'!S15=\"\",\"\",'BİLGİ GİRİŞİ'!S15)","v":456789123}]
["MUAYENE VE KABUL TUTANAĞI\n(DOĞRUDAN TEMİN SONUÇ ONAY BELGESİ)"]
[]
["MAL'IN/HİZMET'İN/YAPIM İŞİ'NİN"]
["S","Kalem/KısımBilgileri",null,null,null,null,null,null,null,null,null,null,null,null,null,null,null,null,null,null,null,null,null,"Birimi",null,null,null,"Miktarı"]
[{"$f":"IF('BİLGİ GİRİŞİ'!D30=\"\",\"\",'BİLGİ GİRİŞİ'!D30)","v":1},{"$f":"IF('BİLGİ GİRİŞİ'!E30=\"\",\"\",'BİLGİ GİRİŞİ'!E30)","v":"AIO (All In One) Masaüstü Bilgisayar "},null,null,null,null,null,null,null,null,null,null,null,null,null,null,null,null,null,null,null,null,null,{"$f":"IF('BİLGİ GİRİŞİ'!W30=\"\",\"\",'BİLGİ GİRİŞİ'!W30)","v":"Adet"},null,null,null,{"$f":"IF('BİLGİ GİRİŞİ'!T30=\"\",\"\",'BİLGİ GİRİŞİ'!T30)","v":2}]
[{"$f":"IF('BİLGİ GİRİŞİ'!D31=\"\",\"\",'BİLGİ GİRİŞİ'!D31)","v":2},{"$f":"IF('BİLGİ GİRİŞİ'!E31=\"\",\"\",'BİLGİ GİRİŞİ'!E31)","v":"Fotokopi Makinesi"},null,null,null,null,null,null,null,null,null,null,null,null,null,null,null,null,null,null,null,null,null,{"$f":"IF('BİLGİ GİRİŞİ'!W31=\"\",\"\",'BİLGİ GİRİŞİ'!W31)","v":"Adet"},null,null,null,{"$f":"IF('BİLGİ GİRİŞİ'!T31=\"\",\"\",'BİLGİ GİRİŞİ'!T31)","v":2}]
[{"$f":"IF('BİLGİ GİRİŞİ'!D32=\"\",\"\",'BİLGİ GİRİŞİ'!D32)","v":3},{"$f":"IF('BİLGİ GİRİŞİ'!E32=\"\",\"\",'BİLGİ GİRİŞİ'!E32)","v":"Projektör"},null,null,null,null,null,null,null,null,null,null,null,null,null,null,null,null,null,null,null,null,null,{"$f":"IF('BİLGİ GİRİŞİ'!W32=\"\",\"\",'BİLGİ GİRİŞİ'!W32)","v":"Adet"},null,null,null,{"$f":"IF('BİLGİ GİRİŞİ'!T32=\"\",\"\",'BİLGİ GİRİŞİ'!T32)","v":2}]
[{"$f":"IF('BİLGİ GİRİŞİ'!D33=\"\",\"\",'BİLGİ GİRİŞİ'!D33)","v":""},{"$f":"IF('BİLGİ GİRİŞİ'!E33=\"\",\"\",'BİLGİ GİRİŞİ'!E33)","v":""},null,null,null,null,null,null,null,null,null,null,null,null,null,null,null,null,null,null,null,null,null,{"$f":"IF('BİLGİ GİRİŞİ'!W33=\"\",\"\",'BİLGİ GİRİŞİ'!W33)","v":""},null,null,null,{"$f":"IF('BİLGİ GİRİŞİ'!T33=\"\",\"\",'BİLGİ GİRİŞİ'!T33)","v":""}]
[{"$f":"IF('BİLGİ GİRİŞİ'!D34=\"\",\"\",'BİLGİ GİRİŞİ'!D34)","v":""},{"$f":"IF('BİLGİ GİRİŞİ'!E34=\"\",\"\",'BİLGİ GİRİŞİ'!E34)","v":""},null,null,null,null,null,null,null,null,null,null,null,null,null,null,null,null,null,null,null,null,null,{"$f":"IF('BİLGİ GİRİŞİ'!W34=\"\",\"\",'BİLGİ GİRİŞİ'!W34)","v":""},null,null,null,{"$f":"IF('BİLGİ GİRİŞİ'!T34=\"\",\"\",'BİLGİ GİRİŞİ'!T34)","v":""}]
[{"$f":"IF('BİLGİ GİRİŞİ'!D35=\"\",\"\",'BİLGİ GİRİŞİ'!D35)","v":""},{"$f":"IF('BİLGİ GİRİŞİ'!E35=\"\",\"\",'BİLGİ GİRİŞİ'!E35)","v":""},null,null,null,null,null,null,null,null,null,null,null,null,null,null,null,null,null,null,null,null,null,{"$f":"IF('BİLGİ GİRİŞİ'!W35=\"\",\"\",'BİLGİ GİRİŞİ'!W35)","v":""},null,null,null,{"$f":"IF('BİLGİ GİRİŞİ'!T35=\"\",\"\",'BİLGİ GİRİŞİ'!T35)","v":""}]
[{"$f":"IF('BİLGİ GİRİŞİ'!D36=\"\",\"\",'BİLGİ GİRİŞİ'!D36)","v":""},{"$f":"IF('BİLGİ GİRİŞİ'!E36=\"\",\"\",'BİLGİ GİRİŞİ'!E36)","v":""},null,null,null,null,null,null,null,null,null,null,null,null,null,null,null,null,null,null,null,null,null,{"$f":"IF('BİLGİ GİRİŞİ'!W36=\"\",\"\",'BİLGİ GİRİŞİ'!W36)","v":""},null,null,null,{"$f":"IF('BİLGİ GİRİŞİ'!T36=\"\",\"\",'BİLGİ GİRİŞİ'!T36)","v":""}]
[{"$f":"IF('BİLGİ GİRİŞİ'!D37=\"\",\"\",'BİLGİ GİRİŞİ'!D37)","v":""},{"$f":"IF('BİLGİ GİRİŞİ'!E37=\"\",\"\",'BİLGİ GİRİŞİ'!E37)","v":""},null,null,null,null,null,null,null,null,null,null,null,null,null,null,null,null,null,null,null,null,null,{"$f":"IF('BİLGİ GİRİŞİ'!W37=\"\",\"\",'BİLGİ GİRİŞİ'!W37)","v":""},null,null,null,{"$f":"IF('BİLGİ GİRİŞİ'!T37=\"\",\"\",'BİLGİ GİRİŞİ'!T37)","v":""}]
[{"$f":"IF('BİLGİ GİRİŞİ'!D38=\"\",\"\",'BİLGİ GİRİŞİ'!D38)","v":""},{"$f":"IF('BİLGİ GİRİŞİ'!E38=\"\",\"\",'BİLGİ GİRİŞİ'!E38)","v":""},null,null,null,null,null,null,null,null,null,null,null,null,null,null,null,null,null,null,null,null,null,{"$f":"IF('BİLGİ GİRİŞİ'!W38=\"\",\"\",'BİLGİ GİRİŞİ'!W38)","v":""},null,null,null,{"$f":"IF('BİLGİ GİRİŞİ'!T38=\"\",\"\",'BİLGİ GİRİŞİ'!T38)","v":""}]
[{"$f":"IF('BİLGİ GİRİŞİ'!D39=\"\",\"\",'BİLGİ GİRİŞİ'!D39)","v":""},{"$f":"IF('BİLGİ GİRİŞİ'!E39=\"\",\"\",'BİLGİ GİRİŞİ'!E39)","v":""},null,null,null,null,null,null,null,null,null,null,null,null,null,null,null,null,null,null,null,null,null,{"$f":"IF('BİLGİ GİRİŞİ'!W39=\"\",\"\",'BİLGİ GİRİŞİ'!W39)","v":""},null,null,null,{"$f":"IF('BİLGİ GİRİŞİ'!T39=\"\",\"\",'BİLGİ GİRİŞİ'!T39)","v":""}]
[{"$f":"IF('BİLGİ GİRİŞİ'!D40=\"\",\"\",'BİLGİ GİRİŞİ'!D40)","v":""},{"$f":"IF('BİLGİ GİRİŞİ'!E40=\"\",\"\",'BİLGİ GİRİŞİ'!E40)","v":""},null,null,null,null,null,null,null,null,null,null,null,null,null,null,null,null,null,null,null,null,null,{"$f":"IF('BİLGİ GİRİŞİ'!W40=\"\",\"\",'BİLGİ GİRİŞİ'!W40)","v":""},null,null,null,{"$f":"IF('BİLGİ GİRİŞİ'!T40=\"\",\"\",'BİLGİ GİRİŞİ'!T40)","v":""}]
[{"$f":"IF('BİLGİ GİRİŞİ'!D41=\"\",\"\",'BİLGİ GİRİŞİ'!D41)","v":""},{"$f":"IF('BİLGİ GİRİŞİ'!E41=\"\",\"\",'BİLGİ GİRİŞİ'!E41)","v":""},null,null,null,null,null,null,null,null,null,null,null,null,null,null,null,null,null,null,null,null,null,{"$f":"IF('BİLGİ GİRİŞİ'!W41=\"\",\"\",'BİLGİ GİRİŞİ'!W41)","v":""},null,null,null,{"$f":"IF('BİLGİ GİRİŞİ'!T41=\"\",\"\",'BİLGİ GİRİŞİ'!T41)","v":""}]
[{"$f":"IF('BİLGİ GİRİŞİ'!D42=\"\",\"\",'BİLGİ GİRİŞİ'!D42)","v":""},{"$f":"IF('BİLGİ GİRİŞİ'!E42=\"\",\"\",'BİLGİ GİRİŞİ'!E42)","v":""},null,null,null,null,null,null,null,null,null,null,null,null,null,null,null,null,null,null,null,null,null,{"$f":"IF('BİLGİ GİRİŞİ'!W42=\"\",\"\",'BİLGİ GİRİŞİ'!W42)","v":""},null,null,null,{"$f":"IF('BİLGİ GİRİŞİ'!T42=\"\",\"\",'BİLGİ GİRİŞİ'!T42)","v":""}]
[{"$f":"IF('BİLGİ GİRİŞİ'!D43=\"\",\"\",'BİLGİ GİRİŞİ'!D43)","v":""},{"$f":"IF('BİLGİ GİRİŞİ'!E43=\"\",\"\",'BİLGİ GİRİŞİ'!E43)","v":""},null,null,null,null,null,null,null,null,null,null,null,null,null,null,null,null,null,null,null,null,null,{"$f":"IF('BİLGİ GİRİŞİ'!W43=\"\",\"\",'BİLGİ GİRİŞİ'!W43)","v":""},null,null,null,{"$f":"IF('BİLGİ GİRİŞİ'!T43=\"\",\"\",'BİLGİ GİRİŞİ'!T43)","v":""}]
[{"$f":"IF('BİLGİ GİRİŞİ'!D44=\"\",\"\",'BİLGİ GİRİŞİ'!D44)","v":""},{"$f":"IF('BİLGİ GİRİŞİ'!E44=\"\",\"\",'BİLGİ GİRİŞİ'!E44)","v":""},null,null,null,null,null,null,null,null,null,null,null,null,null,null,null,null,null,null,null,null,null,{"$f":"IF('BİLGİ GİRİŞİ'!W44=\"\",\"\",'BİLGİ GİRİŞİ'!W44)","v":""},null,null,null,{"$f":"IF('BİLGİ GİRİŞİ'!T44=\"\",\"\",'BİLGİ GİRİŞİ'!T44)","v":""}]
[{"$f":"IF('BİLGİ GİRİŞİ'!D45=\"\",\"\",'BİLGİ GİRİŞİ'!D45)","v":""},{"$f":"IF('BİLGİ GİRİŞİ'!E45=\"\",\"\",'BİLGİ GİRİŞİ'!E45)","v":""},null,null,null,null,null,null,null,null,null,null,null,null,null,null,null,null,null,null,null,null,null,{"$f":"IF('BİLGİ GİRİŞİ'!W45=\"\",\"\",'BİLGİ GİRİŞİ'!W45)","v":""},null,null,null,{"$f":"IF('BİLGİ GİRİŞİ'!T45=\"\",\"\",'BİLGİ GİRİŞİ'!T45)","v":""}]
[{"$f":"IF('BİLGİ GİRİŞİ'!D46=\"\",\"\",'BİLGİ GİRİŞİ'!D46)","v":""},{"$f":"IF('BİLGİ GİRİŞİ'!E46=\"\",\"\",'BİLGİ GİRİŞİ'!E46)","v":""},null,null,null,null,null,null,null,null,null,null,null,null,null,null,null,null,null,null,null,null,null,{"$f":"IF('BİLGİ GİRİŞİ'!W46=\"\",\"\",'BİLGİ GİRİŞİ'!W46)","v":""},null,null,null,{"$f":"IF('BİLGİ GİRİŞİ'!T46=\"\",\"\",'BİLGİ GİRİŞİ'!T46)","v":""}]
[{"$f":"IF('BİLGİ GİRİŞİ'!D47=\"\",\"\",'BİLGİ GİRİŞİ'!D47)","v":""},{"$f":"IF('BİLGİ GİRİŞİ'!E47=\"\",\"\",'BİLGİ GİRİŞİ'!E47)","v":""},null,null,null,null,null,null,null,null,null,null,null,null,null,null,null,null,null,null,null,null,null,{"$f":"IF('BİLGİ GİRİŞİ'!W47=\"\",\"\",'BİLGİ GİRİŞİ'!W47)","v":""},null,null,null,{"$f":"IF('BİLGİ GİRİŞİ'!T47=\"\",\"\",'BİLGİ GİRİŞİ'!T47)","v":""}]
[{"$f":"IF('BİLGİ GİRİŞİ'!D48=\"\",\"\",'BİLGİ GİRİŞİ'!D48)","v":""},{"$f":"IF('BİLGİ GİRİŞİ'!E48=\"\",\"\",'BİLGİ GİRİŞİ'!E48)","v":""},null,null,null,null,null,null,null,null,null,null,null,null,null,null,null,null,null,null,null,null,null,{"$f":"IF('BİLGİ GİRİŞİ'!W48=\"\",\"\",'BİLGİ GİRİŞİ'!W48)","v":""},null,null,null,{"$f":"IF('BİLGİ GİRİŞİ'!T48=\"\",\"\",'BİLGİ GİRİŞİ'!T48)","v":""}]
[{"$f":"IF('BİLGİ GİRİŞİ'!D49=\"\",\"\",'BİLGİ GİRİŞİ'!D49)","v":""},{"$f":"IF('BİLGİ GİRİŞİ'!E49=\"\",\"\",'BİLGİ GİRİŞİ'!E49)","v":""},null,null,null,null,null,null,null,null,null,null,null,null,null,null,null,null,null,null,null,null,null,{"$f":"IF('BİLGİ GİRİŞİ'!W49=\"\",\"\",'BİLGİ GİRİŞİ'!W49)","v":""},null,null,null,{"$f":"IF('BİLGİ GİRİŞİ'!T49=\"\",\"\",'BİLGİ GİRİŞİ'!T49)","v":""}]
[{"$f":"IF('BİLGİ GİRİŞİ'!D50=\"\",\"\",'BİLGİ GİRİŞİ'!D50)","v":""},{"$f":"IF('BİLGİ GİRİŞİ'!E50=\"\",\"\",'BİLGİ GİRİŞİ'!E50)","v":""},null,null,null,null,null,null,null,null,null,null,null,null,null,null,null,null,null,null,null,null,null,{"$f":"IF('BİLGİ GİRİŞİ'!W50=\"\",\"\",'BİLGİ GİRİŞİ'!W50)","v":""},null,null,null,{"$f":"IF('BİLGİ GİRİŞİ'!T50=\"\",\"\",'BİLGİ GİRİŞİ'!T50)","v":""}]
[{"$f":"IF('BİLGİ GİRİŞİ'!D51=\"\",\"\",'BİLGİ GİRİŞİ'!D51)","v":""},{"$f":"IF('BİLGİ GİRİŞİ'!E51=\"\",\"\",'BİLGİ GİRİŞİ'!E51)","v":""},null,null,null,null,null,null,null,null,null,null,null,null,null,null,null,null,null,null,null,null,null,{"$f":"IF('BİLGİ GİRİŞİ'!W51=\"\",\"\",'BİLGİ GİRİŞİ'!W51)","v":""},null,null,null,{"$f":"IF('BİLGİ GİRİŞİ'!T51=\"\",\"\",'BİLGİ GİRİŞİ'!T51)","v":""}]
[{"$f":"IF('BİLGİ GİRİŞİ'!D52=\"\",\"\",'BİLGİ GİRİŞİ'!D52)","v":""},{"$f":"IF('BİLGİ GİRİŞİ'!E52=\"\",\"\",'BİLGİ GİRİŞİ'!E52)","v":""},null,null,null,null,null,null,null,null,null,null,null,null,null,null,null,null,null,null,null,null,null,{"$f":"IF('BİLGİ GİRİŞİ'!W52=\"\",\"\",'BİLGİ GİRİŞİ'!W52)","v":""},null,null,null,{"$f":"IF('BİLGİ GİRİŞİ'!T52=\"\",\"\",'BİLGİ GİRİŞİ'!T52)","v":""}]
[{"$f":"IF('BİLGİ GİRİŞİ'!D53=\"\",\"\",'BİLGİ GİRİŞİ'!D53)","v":""},{"$f":"IF('BİLGİ GİRİŞİ'!E53=\"\",\"\",'BİLGİ GİRİŞİ'!E53)","v":""},null,null,null,null,null,null,null,null,null,null,null,null,null,null,null,null,null,null,null,null,null,{"$f":"IF('BİLGİ GİRİŞİ'!W53=\"\",\"\",'BİLGİ GİRİŞİ'!W53)","v":""},null,null,null,{"$f":"IF('BİLGİ GİRİŞİ'!T53=\"\",\"\",'BİLGİ GİRİŞİ'!T53)","v":""}]
[{"$f":"IF('BİLGİ GİRİŞİ'!D54=\"\",\"\",'BİLGİ GİRİŞİ'!D54)","v":""},{"$f":"IF('BİLGİ GİRİŞİ'!E54=\"\",\"\",'BİLGİ GİRİŞİ'!E54)","v":""},null,null,null,null,null,null,null,null,null,null,null,null,null,null,null,null,null,null,null,null,null,{"$f":"IF('BİLGİ GİRİŞİ'!W54=\"\",\"\",'BİLGİ GİRİŞİ'!W54)","v":""},null,null,null,{"$f":"IF('BİLGİ GİRİŞİ'!T54=\"\",\"\",'BİLGİ GİRİŞİ'!T54)","v":""}]
[{"$f":"IF('BİLGİ GİRİŞİ'!D55=\"\",\"\",'BİLGİ GİRİŞİ'!D55)","v":""},{"$f":"IF('BİLGİ GİRİŞİ'!E55=\"\",\"\",'BİLGİ GİRİŞİ'!E55)","v":""},null,null,null,null,null,null,null,null,null,null,null,null,null,null,null,null,null,null,null,null,null,{"$f":"IF('BİLGİ GİRİŞİ'!W55=\"\",\"\",'BİLGİ GİRİŞİ'!W55)","v":""},null,null,null,{"$f":"IF('BİLGİ GİRİŞİ'!T55=\"\",\"\",'BİLGİ GİRİŞİ'!T55)","v":""}]
[{"$f":"IF('BİLGİ GİRİŞİ'!D56=\"\",\"\",'BİLGİ GİRİŞİ'!D56)","v":""},{"$f":"IF('BİLGİ GİRİŞİ'!E56=\"\",\"\",'BİLGİ GİRİŞİ'!E56)","v":""},null,null,null,null,null,null,null,null,null,null,null,null,null,null,null,null,null,null,null,null,null,{"$f":"IF('BİLGİ GİRİŞİ'!W56=\"\",\"\",'BİLGİ GİRİŞİ'!W56)","v":""},null,null,null,{"$f":"IF('BİLGİ GİRİŞİ'!T56=\"\",\"\",'BİLGİ GİRİŞİ'!T56)","v":""}]
[{"$f":"IF('BİLGİ GİRİŞİ'!D57=\"\",\"\",'BİLGİ GİRİŞİ'!D57)","v":""},{"$f":"IF('BİLGİ GİRİŞİ'!E57=\"\",\"\",'BİLGİ GİRİŞİ'!E57)","v":""},null,null,null,null,null,null,null,null,null,null,null,null,null,null,null,null,null,null,null,null,null,{"$f":"IF('BİLGİ GİRİŞİ'!W57=\"\",\"\",'BİLGİ GİRİŞİ'!W57)","v":""},null,null,null,{"$f":"IF('BİLGİ GİRİŞİ'!T57=\"\",\"\",'BİLGİ GİRİŞİ'!T57)","v":""}]
[{"$f":"IF('BİLGİ GİRİŞİ'!D58=\"\",\"\",'BİLGİ GİRİŞİ'!D58)","v":""},{"$f":"IF('BİLGİ GİRİŞİ'!E58=\"\",\"\",'BİLGİ GİRİŞİ'!E58)","v":""},null,null,null,null,null,null,null,null,null,null,null,null,null,null,null,null,null,null,null,null,null,{"$f":"IF('BİLGİ GİRİŞİ'!W58=\"\",\"\",'BİLGİ GİRİŞİ'!W58)","v":""},null,null,null,{"$f":"IF('BİLGİ GİRİŞİ'!T58=\"\",\"\",'BİLGİ GİRİŞİ'!T58)","v":""}]
[{"$f":"IF('BİLGİ GİRİŞİ'!D59=\"\",\"\",'BİLGİ GİRİŞİ'!D59)","v":""},{"$f":"IF('BİLGİ GİRİŞİ'!E59=\"\",\"\",'BİLGİ GİRİŞİ'!E59)","v":""},null,null,null,null,null,null,null,null,null,null,null,null,null,null,null,null,null,null,null,null,null,{"$f":"IF('BİLGİ GİRİŞİ'!W59=\"\",\"\",'BİLGİ GİRİŞİ'!W59)","v":""},null,null,null,{"$f":"IF('BİLGİ GİRİŞİ'!T59=\"\",\"\",'BİLGİ GİRİŞİ'!T59)","v":""}]
[{"$f":"IF('BİLGİ GİRİŞİ'!D60=\"\",\"\",'BİLGİ GİRİŞİ'!D60)","v":""},{"$f":"IF('BİLGİ GİRİŞİ'!E60=\"\",\"\",'BİLGİ GİRİŞİ'!E60)","v":""},null,null,null,null,null,null,null,null,null,null,null,null,null,null,null,null,null,null,null,null,null,{"$f":"IF('BİLGİ GİRİŞİ'!W60=\"\",\"\",'BİLGİ GİRİŞİ'!W60)","v":""},null,null,null,{"$f":"IF('BİLGİ GİRİŞİ'!T60=\"\",\"\",'BİLGİ GİRİŞİ'!T60)","v":""}]
[{"$f":"IF('BİLGİ GİRİŞİ'!D61=\"\",\"\",'BİLGİ GİRİŞİ'!D61)","v":""},{"$f":"IF('BİLGİ GİRİŞİ'!E61=\"\",\"\",'BİLGİ GİRİŞİ'!E61)","v":""},null,null,null,null,null,null,null,null,null,null,null,null,null,null,null,null,null,null,null,null,null,{"$f":"IF('BİLGİ GİRİŞİ'!W61=\"\",\"\",'BİLGİ GİRİŞİ'!W61)","v":""},null,null,null,{"$f":"IF('BİLGİ GİRİŞİ'!T61=\"\",\"\",'BİLGİ GİRİŞİ'!T61)","v":""}]
[{"$f":"IF('BİLGİ GİRİŞİ'!D62=\"\",\"\",'BİLGİ GİRİŞİ'!D62)","v":""},{"$f":"IF('BİLGİ GİRİŞİ'!E62=\"\",\"\",'BİLGİ GİRİŞİ'!E62)","v":""},null,null,null,null,null,null,null,null,null,null,null,null,null,null,null,null,null,null,null,null,null,{"$f":"IF('BİLGİ GİRİŞİ'!W62=\"\",\"\",'BİLGİ GİRİŞİ'!W62)","v":""},null,null,null,{"$f":"IF('BİLGİ GİRİŞİ'!T62=\"\",\"\",'BİLGİ GİRİŞİ'!T62)","v":""}]
[{"$f":"IF('BİLGİ GİRİŞİ'!D63=\"\",\"\",'BİLGİ GİRİŞİ'!D63)","v":""},{"$f":"IF('BİLGİ GİRİŞİ'!E63=\"\",\"\",'BİLGİ GİRİŞİ'!E63)","v":""},null,null,null,null,null,null,null,null,null,null,null,null,null,null,null,null,null,null,null,null,null,{"$f":"IF('BİLGİ GİRİŞİ'!W63=\"\",\"\",'BİLGİ GİRİŞİ'!W63)","v":""},null,null,null,{"$f":"IF('BİLGİ GİRİŞİ'!T63=\"\",\"\",'BİLGİ GİRİŞİ'!T63)","v":""}]
[{"$f":"IF('BİLGİ GİRİŞİ'!D64=\"\",\"\",'BİLGİ GİRİŞİ'!D64)","v":""},{"$f":"IF('BİLGİ GİRİŞİ'!E64=\"\",\"\",'BİLGİ GİRİŞİ'!E64)","v":""},null,null,null,null,null,null,null,null,null,null,null,null,null,null,null,null,null,null,null,null,null,{"$f":"IF('BİLGİ GİRİŞİ'!W64=\"\",\"\",'BİLGİ GİRİŞİ'!W64)","v":""},null,null,null,{"$f":"IF('BİLGİ GİRİŞİ'!T64=\"\",\"\",'BİLGİ GİRİŞİ'!T64)","v":""}]
[{"$f":"IF('BİLGİ GİRİŞİ'!D65=\"\",\"\",'BİLGİ GİRİŞİ'!D65)","v":""},{"$f":"IF('BİLGİ GİRİŞİ'!E65=\"\",\"\",'BİLGİ GİRİŞİ'!E65)","v":""},null,null,null,null,null,null,null,null,null,null,null,null,null,null,null,null,null,null,null,null,null,{"$f":"IF('BİLGİ GİRİŞİ'!W65=\"\",\"\",'BİLGİ GİRİŞİ'!W65)","v":""},null,null,null,{"$f":"IF('BİLGİ GİRİŞİ'!T65=\"\",\"\",'BİLGİ GİRİŞİ'!T65)","v":""}]
[{"$f":"IF('BİLGİ GİRİŞİ'!D66=\"\",\"\",'BİLGİ GİRİŞİ'!D66)","v":""},{"$f":"IF('BİLGİ GİRİŞİ'!E66=\"\",\"\",'BİLGİ GİRİŞİ'!E66)","v":""},null,null,null,null,null,null,null,null,null,null,null,null,null,null,null,null,null,null,null,null,null,{"$f":"IF('BİLGİ GİRİŞİ'!W66=\"\",\"\",'BİLGİ GİRİŞİ'!W66)","v":""},null,null,null,{"$f":"IF('BİLGİ GİRİŞİ'!T66=\"\",\"\",'BİLGİ GİRİŞİ'!T66)","v":""}]
[{"$f":"IF('BİLGİ GİRİŞİ'!D67=\"\",\"\",'BİLGİ GİRİŞİ'!D67)","v":""},{"$f":"IF('BİLGİ GİRİŞİ'!E67=\"\",\"\",'BİLGİ GİRİŞİ'!E67)","v":""},null,null,null,null,null,null,null,null,null,null,null,null,null,null,null,null,null,null,null,null,null,{"$f":"IF('BİLGİ GİRİŞİ'!W67=\"\",\"\",'BİLGİ GİRİŞİ'!W67)","v":""},null,null,null,{"$f":"IF('BİLGİ GİRİŞİ'!T67=\"\",\"\",'BİLGİ GİRİŞİ'!T67)","v":""}]
[{"$f":"IF('BİLGİ GİRİŞİ'!D68=\"\",\"\",'BİLGİ GİRİŞİ'!D68)","v":""},{"$f":"IF('BİLGİ GİRİŞİ'!E68=\"\",\"\",'BİLGİ GİRİŞİ'!E68)","v":""},null,null,null,null,null,null,null,null,null,null,null,null,null,null,null,null,null,null,null,null,null,{"$f":"IF('BİLGİ GİRİŞİ'!W68=\"\",\"\",'BİLGİ GİRİŞİ'!W68)","v":""},null,null,null,{"$f":"IF('BİLGİ GİRİŞİ'!T68=\"\",\"\",'BİLGİ GİRİŞİ'!T68)","v":""}]
[{"$f":"IF('BİLGİ GİRİŞİ'!D69=\"\",\"\",'BİLGİ GİRİŞİ'!D69)","v":""},{"$f":"IF('BİLGİ GİRİŞİ'!E69=\"\",\"\",'BİLGİ GİRİŞİ'!E69)","v":""},null,null,null,null,null,null,null,null,null,null,null,null,null,null,null,null,null,null,null,null,null,{"$f":"IF('BİLGİ GİRİŞİ'!W69=\"\",\"\",'BİLGİ GİRİŞİ'!W69)","v":""},null,null,null,{"$f":"IF('BİLGİ GİRİŞİ'!T69=\"\",\"\",'BİLGİ GİRİŞİ'!T69)","v":""}]
[{"$f":"IF('BİLGİ GİRİŞİ'!D70=\"\",\"\",'BİLGİ GİRİŞİ'!D70)","v":""},{"$f":"IF('BİLGİ GİRİŞİ'!E70=\"\",\"\",'BİLGİ GİRİŞİ'!E70)","v":""},null,null,null,null,null,null,null,null,null,null,null,null,null,null,null,null,null,null,null,null,null,{"$f":"IF('BİLGİ GİRİŞİ'!W70=\"\",\"\",'BİLGİ GİRİŞİ'!W70)","v":""},null,null,null,{"$f":"IF('BİLGİ GİRİŞİ'!T70=\"\",\"\",'BİLGİ GİRİŞİ'!T70)","v":""}]
[{"$f":"IF('BİLGİ GİRİŞİ'!D71=\"\",\"\",'BİLGİ GİRİŞİ'!D71)","v":""},{"$f":"IF('BİLGİ GİRİŞİ'!E71=\"\",\"\",'BİLGİ GİRİŞİ'!E71)","v":""},null,null,null,null,null,null,null,null,null,null,null,null,null,null,null,null,null,null,null,null,null,{"$f":"IF('BİLGİ GİRİŞİ'!W71=\"\",\"\",'BİLGİ GİRİŞİ'!W71)","v":""},null,null,null,{"$f":"IF('BİLGİ GİRİŞİ'!T71=\"\",\"\",'BİLGİ GİRİŞİ'!T71)","v":""}]
[{"$f":"IF('BİLGİ GİRİŞİ'!D72=\"\",\"\",'BİLGİ GİRİŞİ'!D72)","v":""},{"$f":"IF('BİLGİ GİRİŞİ'!E72=\"\",\"\",'BİLGİ GİRİŞİ'!E72)","v":""},null,null,null,null,null,null,null,null,null,null,null,null,null,null,null,null,null,null,null,null,null,{"$f":"IF('BİLGİ GİRİŞİ'!W72=\"\",\"\",'BİLGİ GİRİŞİ'!W72)","v":""},null,null,null,{"$f":"IF('BİLGİ GİRİŞİ'!T72=\"\",\"\",'BİLGİ GİRİŞİ'!T72)","v":""}]
[{"$f":"IF('BİLGİ GİRİŞİ'!D73=\"\",\"\",'BİLGİ GİRİŞİ'!D73)","v":""},{"$f":"IF('BİLGİ GİRİŞİ'!E73=\"\",\"\",'BİLGİ GİRİŞİ'!E73)","v":""},null,null,null,null,null,null,null,null,null,null,null,null,null,null,null,null,null,null,null,null,null,{"$f":"IF('BİLGİ GİRİŞİ'!W73=\"\",\"\",'BİLGİ GİRİŞİ'!W73)","v":""},null,null,null,{"$f":"IF('BİLGİ GİRİŞİ'!T73=\"\",\"\",'BİLGİ GİRİŞİ'!T73)","v":""}]
[{"$f":"IF('BİLGİ GİRİŞİ'!D74=\"\",\"\",'BİLGİ GİRİŞİ'!D74)","v":""},{"$f":"IF('BİLGİ GİRİŞİ'!E74=\"\",\"\",'BİLGİ GİRİŞİ'!E74)","v":""},null,null,null,null,null,null,null,null,null,null,null,null,null,null,null,null,null,null,null,null,null,{"$f":"IF('BİLGİ GİRİŞİ'!W74=\"\",\"\",'BİLGİ GİRİŞİ'!W74)","v":""},null,null,null,{"$f":"IF('BİLGİ GİRİŞİ'!T74=\"\",\"\",'BİLGİ GİRİŞİ'!T74)","v":""}]
[{"$f":"IF('BİLGİ GİRİŞİ'!D75=\"\",\"\",'BİLGİ GİRİŞİ'!D75)","v":""},{"$f":"IF('BİLGİ GİRİŞİ'!E75=\"\",\"\",'BİLGİ GİRİŞİ'!E75)","v":""},null,null,null,null,null,null,null,null,null,null,null,null,null,null,null,null,null,null,null,null,null,{"$f":"IF('BİLGİ GİRİŞİ'!W75=\"\",\"\",'BİLGİ GİRİŞİ'!W75)","v":""},null,null,null,{"$f":"IF('BİLGİ GİRİŞİ'!T75=\"\",\"\",'BİLGİ GİRİŞİ'!T75)","v":""}]
[{"$f":"IF('BİLGİ GİRİŞİ'!D76=\"\",\"\",'BİLGİ GİRİŞİ'!D76)","v":""},{"$f":"IF('BİLGİ GİRİŞİ'!E76=\"\",\"\",'BİLGİ GİRİŞİ'!E76)","v":""},null,null,null,null,null,null,null,null,null,null,null,null,null,null,null,null,null,null,null,null,null,{"$f":"IF('BİLGİ GİRİŞİ'!W76=\"\",\"\",'BİLGİ GİRİŞİ'!W76)","v":""},null,null,null,{"$f":"IF('BİLGİ GİRİŞİ'!T76=\"\",\"\",'BİLGİ GİRİŞİ'!T76)","v":""}]
[{"$f":"IF('BİLGİ GİRİŞİ'!D77=\"\",\"\",'BİLGİ GİRİŞİ'!D77)","v":""},{"$f":"IF('BİLGİ GİRİŞİ'!E77=\"\",\"\",'BİLGİ GİRİŞİ'!E77)","v":""},null,null,null,null,null,null,null,null,null,null,null,null,null,null,null,null,null,null,null,null,null,{"$f":"IF('BİLGİ GİRİŞİ'!W77=\"\",\"\",'BİLGİ GİRİŞİ'!W77)","v":""},null,null,null,{"$f":"IF('BİLGİ GİRİŞİ'!T77=\"\",\"\",'BİLGİ GİRİŞİ'!T77)","v":""}]
[{"$f":"IF('BİLGİ GİRİŞİ'!D78=\"\",\"\",'BİLGİ GİRİŞİ'!D78)","v":""},{"$f":"IF('BİLGİ GİRİŞİ'!E78=\"\",\"\",'BİLGİ GİRİŞİ'!E78)","v":""},null,null,null,null,null,null,null,null,null,null,null,null,null,null,null,null,null,null,null,null,null,{"$f":"IF('BİLGİ GİRİŞİ'!W78=\"\",\"\",'BİLGİ GİRİŞİ'!W78)","v":""},null,null,null,{"$f":"IF('BİLGİ GİRİŞİ'!T78=\"\",\"\",'BİLGİ GİRİŞİ'!T78)","v":""}]
[{"$f":"IF('BİLGİ GİRİŞİ'!D79=\"\",\"\",'BİLGİ GİRİŞİ'!D79)","v":""},{"$f":"IF('BİLGİ GİRİŞİ'!E79=\"\",\"\",'BİLGİ GİRİŞİ'!E79)","v":""},null,null,null,null,null,null,null,null,null,null,null,null,null,null,null,null,null,null,null,null,null,{"$f":"IF('BİLGİ GİRİŞİ'!W79=\"\",\"\",'BİLGİ GİRİŞİ'!W79)","v":""},null,null,null,{"$f":"IF('BİLGİ GİRİŞİ'!T79=\"\",\"\",'BİLGİ GİRİŞİ'!T79)","v":""}]
[{"$f":"IF('BİLGİ GİRİŞİ'!D80=\"\",\"\",'BİLGİ GİRİŞİ'!D80)","v":""},{"$f":"IF('BİLGİ GİRİŞİ'!E80=\"\",\"\",'BİLGİ GİRİŞİ'!E80)","v":""},null,null,null,null,null,null,null,null,null,null,null,null,null,null,null,null,null,null,null,null,null,{"$f":"IF('BİLGİ GİRİŞİ'!W80=\"\",\"\",'BİLGİ GİRİŞİ'!W80)","v":""},null,null,null,{"$f":"IF('BİLGİ GİRİŞİ'!T80=\"\",\"\",'BİLGİ GİRİŞİ'!T80)","v":""}]
[{"$f":"IF('BİLGİ GİRİŞİ'!D81=\"\",\"\",'BİLGİ GİRİŞİ'!D81)","v":""},{"$f":"IF('BİLGİ GİRİŞİ'!E81=\"\",\"\",'BİLGİ GİRİŞİ'!E81)","v":""},null,null,null,null,null,null,null,null,null,null,null,null,null,null,null,null,null,null,null,null,null,{"$f":"IF('BİLGİ GİRİŞİ'!W81=\"\",\"\",'BİLGİ GİRİŞİ'!W81)","v":""},null,null,null,{"$f":"IF('BİLGİ GİRİŞİ'!T81=\"\",\"\",'BİLGİ GİRİŞİ'!T81)","v":""}]
[{"$f":"IF('BİLGİ GİRİŞİ'!D82=\"\",\"\",'BİLGİ GİRİŞİ'!D82)","v":""},{"$f":"IF('BİLGİ GİRİŞİ'!E82=\"\",\"\",'BİLGİ GİRİŞİ'!E82)","v":""},null,null,null,null,null,null,null,null,null,null,null,null,null,null,null,null,null,null,null,null,null,{"$f":"IF('BİLGİ GİRİŞİ'!W82=\"\",\"\",'BİLGİ GİRİŞİ'!W82)","v":""},null,null,null,{"$f":"IF('BİLGİ GİRİŞİ'!T82=\"\",\"\",'BİLGİ GİRİŞİ'!T82)","v":""}]
[{"$f":"IF('BİLGİ GİRİŞİ'!D83=\"\",\"\",'BİLGİ GİRİŞİ'!D83)","v":""},{"$f":"IF('BİLGİ GİRİŞİ'!E83=\"\",\"\",'BİLGİ GİRİŞİ'!E83)","v":""},null,null,null,null,null,null,null,null,null,null,null,null,null,null,null,null,null,null,null,null,null,{"$f":"IF('BİLGİ GİRİŞİ'!W83=\"\",\"\",'BİLGİ GİRİŞİ'!W83)","v":""},null,null,null,{"$f":"IF('BİLGİ GİRİŞİ'!T83=\"\",\"\",'BİLGİ GİRİŞİ'!T83)","v":""}]
[{"$f":"IF('BİLGİ GİRİŞİ'!D84=\"\",\"\",'BİLGİ GİRİŞİ'!D84)","v":""},{"$f":"IF('BİLGİ GİRİŞİ'!E84=\"\",\"\",'BİLGİ GİRİŞİ'!E84)","v":""},null,null,null,null,null,null,null,null,null,null,null,null,null,null,null,null,null,null,null,null,null,{"$f":"IF('BİLGİ GİRİŞİ'!W84=\"\",\"\",'BİLGİ GİRİŞİ'!W84)","v":""},null,null,null,{"$f":"IF('BİLGİ GİRİŞİ'!T84=\"\",\"\",'BİLGİ GİRİŞİ'!T84)","v":""}]
[{"$f":"IF('BİLGİ GİRİŞİ'!D85=\"\",\"\",'BİLGİ GİRİŞİ'!D85)","v":""},{"$f":"IF('BİLGİ GİRİŞİ'!E85=\"\",\"\",'BİLGİ GİRİŞİ'!E85)","v":""},null,null,null,null,null,null,null,null,null,null,null,null,null,null,null,null,null,null,null,null,null,{"$f":"IF('BİLGİ GİRİŞİ'!W85=\"\",\"\",'BİLGİ GİRİŞİ'!W85)","v":""},null,null,null,{"$f":"IF('BİLGİ GİRİŞİ'!T85=\"\",\"\",'BİLGİ GİRİŞİ'!T85)","v":""}]
[{"$f":"IF('BİLGİ GİRİŞİ'!D86=\"\",\"\",'BİLGİ GİRİŞİ'!D86)","v":""},{"$f":"IF('BİLGİ GİRİŞİ'!E86=\"\",\"\",'BİLGİ GİRİŞİ'!E86)","v":""},null,null,null,null,null,null,null,null,null,null,null,null,null,null,null,null,null,null,null,null,null,{"$f":"IF('BİLGİ GİRİŞİ'!W86=\"\",\"\",'BİLGİ GİRİŞİ'!W86)","v":""},null,null,null,{"$f":"IF('BİLGİ GİRİŞİ'!T86=\"\",\"\",'BİLGİ GİRİŞİ'!T86)","v":""}]
[{"$f":"IF('BİLGİ GİRİŞİ'!D87=\"\",\"\",'BİLGİ GİRİŞİ'!D87)","v":""},{"$f":"IF('BİLGİ GİRİŞİ'!E87=\"\",\"\",'BİLGİ GİRİŞİ'!E87)","v":""},null,null,null,null,null,null,null,null,null,null,null,null,null,null,null,null,null,null,null,null,null,{"$f":"IF('BİLGİ GİRİŞİ'!W87=\"\",\"\",'BİLGİ GİRİŞİ'!W87)","v":""},null,null,null,{"$f":"IF('BİLGİ GİRİŞİ'!T87=\"\",\"\",'BİLGİ GİRİŞİ'!T87)","v":""}]
[{"$f":"IF('BİLGİ GİRİŞİ'!D88=\"\",\"\",'BİLGİ GİRİŞİ'!D88)","v":""},{"$f":"IF('BİLGİ GİRİŞİ'!E88=\"\",\"\",'BİLGİ GİRİŞİ'!E88)","v":""},null,null,null,null,null,null,null,null,null,null,null,null,null,null,null,null,null,null,null,null,null,{"$f":"IF('BİLGİ GİRİŞİ'!W88=\"\",\"\",'BİLGİ GİRİŞİ'!W88)","v":""},null,null,null,{"$f":"IF('BİLGİ GİRİŞİ'!T88=\"\",\"\",'BİLGİ GİRİŞİ'!T88)","v":""}]
[{"$f":"IF('BİLGİ GİRİŞİ'!D89=\"\",\"\",'BİLGİ GİRİŞİ'!D89)","v":""},{"$f":"IF('BİLGİ GİRİŞİ'!E89=\"\",\"\",'BİLGİ GİRİŞİ'!E89)","v":""},null,null,null,null,null,null,null,null,null,null,null,null,null,null,null,null,null,null,null,null,null,{"$f":"IF('BİLGİ GİRİŞİ'!W89=\"\",\"\",'BİLGİ GİRİŞİ'!W89)","v":""},null,null,null,{"$f":"IF('BİLGİ GİRİŞİ'!T89=\"\",\"\",'BİLGİ GİRİŞİ'!T89)","v":""}]
[]
["S","TEKLİF VEREN GERÇEK/TÜZEL KİŞİLER",null,null,null,null,null,null,null,null,null,null,null,null,null,null,null,null,null,null,null,null,null,"TEKLİF FİYATLARI"]
[1,{"$f":"IF('BİLGİ GİRİŞİ'!AB95=\"\",\"\",'BİLGİ GİRİŞİ'!AB95)","v":"A GERÇEK/TÜZEL KİŞİSİ"},null,null,null,null,null,null,null,null,null,null,null,null,null,null,null,null,null,null,null,null,null,{"$f":"IF('BİLGİ GİRİŞİ'!AF157=\"\",\"\",'BİLGİ GİRİŞİ'!AF157)","v":24000}]
[2,{"$f":"IF('BİLGİ GİRİŞİ'!AJ95=\"\",\"\",'BİLGİ GİRİŞİ'!AJ95)","v":"B GERÇEK/TÜZEL KİŞİSİ"},null,null,null,null,null,null,null,null,null,null,null,null,null,null,null,null,null,null,null,null,null,{"$f":"IF('BİLGİ GİRİŞİ'!AN157=\"\",\"\",'BİLGİ GİRİŞİ'!AN157)","v":30000}]
[3,{"$f":"IF('BİLGİ GİRİŞİ'!AR95=\"\",\"\",'BİLGİ GİRİŞİ'!AR95)","v":"D GERÇEK/TÜZEL KİŞİSİ"},null,null,null,null,null,null,null,null,null,null,null,null,null,null,null,null,null,null,null,null,null,{"$f":"IF('BİLGİ GİRİŞİ'!AV157=\"\",\"\",'BİLGİ GİRİŞİ'!AV157)","v":36000}]
[]
["EN UYGUN (DÜŞÜK) TEKLİFİ VEREN VE TEKLİFİ UYGUN GÖRÜLEN GERÇEK/TÜZEL KİŞİ"]
["S","Adı",null,null,null,null,null,null,null,null,null,null,null,null,null,null,null,null,null,null,null,null,null,"Teklif Fiyatı"]
[1,{"$f":"IF('BİLGİ GİRİŞİ'!D161=\"\",\"\",'BİLGİ GİRİŞİ'!D161)","v":"A GERÇEK/TÜZEL KİŞİSİ"},null,null,null,null,null,null,null,null,null,null,null,null,null,null,null,null,null,null,null,null,null,{"$f":"IF('BİLGİ GİRİŞİ'!AF161=\"\",\"\",'BİLGİ GİRİŞİ'!AF161)","v":24000}]
[]
["       Yukarıda bilgileri verilen Mal/Hizmet/Yapım İşi, idarenin belirlediği şartlar dahilinde muayenesi yapılmış olup kabule engel herhangi bir durum tespit edilmemiştir. Söz konusu işin yukarıda alım yapılması uygun görülen gerçek/tüzel kişiden Doğrudan Temin yoluyla satın alınması hususunu;\n       Olurlarınıza arz ederim/ederiz."]
[]
[]
[]
[]
[{"$f":"IF(A88=\"\",\"\",IF('BİLGİ GİRİŞİ'!AH21=\"\",\"\",'BİLGİ GİRİŞİ'!AH21))","v":"Muayene ve Kabul Görevlisi"},null,null,null,null,null,null,null,null,null,{"$f":"IF(K88=\"\",\"\",IF('BİLGİ GİRİŞİ'!AN21=\"\",\"\",'BİLGİ GİRİŞİ'!AN21))","v":""},null,null,null,null,null,null,null,null,null,{"$f":"IF(U88=\"\",\"\",IF('BİLGİ GİRİŞİ'!AB21=\"\",\"\",'BİLGİ GİRİŞİ'!AB21))","v":"Muayene ve Kabul Görevlisi"}]
[{"$f":"IF(A88=\"\",\"\",IF('BİLGİ GİRİŞİ'!O23=\"\",\"…../…../……..\",'BİLGİ GİRİŞİ'!O23))","v":"2023-03-08"},null,null,null,null,null,null,null,null,null,{"$f":"IF(K88=\"\",\"\",IF('BİLGİ GİRİŞİ'!O23=\"\",\"…../…../……..\",'BİLGİ GİRİŞİ'!O23))","v":""},null,null,null,null,null,null,null,null,null,{"$f":"IF(U88=\"\",\"\",IF('BİLGİ GİRİŞİ'!O23=\"\",\"…../…../……..\",'BİLGİ GİRİŞİ'!O23))","v":"2023-03-08"}]
[]
[{"$f":"IF('BİLGİ GİRİŞİ'!AH22=\"\",\"\",'BİLGİ GİRİŞİ'!AH22)","v":"Fatma GÜNEŞ"},null,null,null,null,null,null,null,null,null,{"$f":"IF('BİLGİ GİRİŞİ'!AN22=\"\",\"\",'BİLGİ GİRİŞİ'!AN22)","v":""},null,null,null,null,null,null,null,null,null,{"$f":"IF('BİLGİ GİRİŞİ'!AB22=\"\",\"\",'BİLGİ GİRİŞİ'!AB22)","v":"Mehmet  ÇELİK"}]
[{"$f":"IF('BİLGİ GİRİŞİ'!AH23=\"\",\"\",'BİLGİ GİRİŞİ'!AH23)","v":"Öğretmen 2"},null,null,null,null,null,null,null,null,null,{"$f":"IF(K88=\"\",\"\",IF('BİLGİ GİRİŞİ'!AN23=\"\",\"\",'BİLGİ GİRİŞİ'!AN23))","v":""},null,null,null,null,null,null,null,null,null,{"$f":"IF('BİLGİ GİRİŞİ'!AB23=\"\",\"\",'BİLGİ GİRİŞİ'!AB23)","v":"Müdür Yardımcısı 2"}]
[]
[]
[{"$f":"IF(A95=\"\",\"\",IF('BİLGİ GİRİŞİ'!AT21=\"\",\"\",'BİLGİ GİRİŞİ'!AT21))","v":"OLUR/UYGUNDUR"}]
[{"$f":"IF(A95=\"\",\"\",IF('BİLGİ GİRİŞİ'!O23=\"\",\"…../…../……..\",'BİLGİ GİRİŞİ'!O23))","v":"2023-03-08"}]
[]
[{"$f":"IF('BİLGİ GİRİŞİ'!AT22=\"\",\"\",'BİLGİ GİRİŞİ'!AT22)","v":"Mustafa AYDIN"}]
[{"$f":"IF(A95=\"\",\"\",'BİLGİ GİRİŞİ'!AT23)","v":"Okul Müdürü"}]
[]
["Ek: Piyasa Fiyat Araştırma Tutanağı"]

{"sheet":"KAPAK","index":10,"n_rows":42,"n_cols":28,"rows_kept":42,"cut":false,"hidden":false,"merged":[[40,10,40,20],[40,21,40,30],[42,0,42,30],[40,0,40,9],[41,0,41,9],[38,0,38,9],[38,10,38,19],[38,20,38,30],[39,0,39,9],[39,10,39,19],[39,20,39,30],[35,10,35,19],[35,20,35,30],[36,0,36,9],[36,10,36,19],[36,20,36,30],[35,0,35,2],[35,5,35,9],[27,27,27,30],[27,1,27,26],[32,0,32,26],[32,27,32,30],[26,27,26,30],[26,1,26,26],[30,27,30,30],[31,27,31,30],[30,1,30,26],[31,1,31,26],[28,27,28,30],[29,27,29,30],[28,1,28,26],[29,1,29,26],[25,27,25,30],[24,1,24,26],[25,1,25,26],[18,1,18,26],[18,27,18,30],[22,27,22,30],[23,27,23,30],[23,1,23,26],[19,1,19,26],[19,27,19,30],[22,1,22,26],[20,1,20,26],[20,27,20,30],[21,1,21,26],[21,27,21,30],[14,0,14,30],[15,27,15,30],[3,0,3,30],[4,0,4,30],[24,27,24,30],[13,0,13,30],[16,1,16,26],[16,27,16,30],[17,1,17,26],[17,27,17,30],[5,0,5,30],[10,0,10,30],[9,0,9,30],[15,1,15,26],[1,0,1,9],[1,11,1,30],[2,0,2,9],[2,11,2,14],[2,16,2,30]]}
[]
[]
[]
["T.C."]
[{"$f":"IF('BİLGİ GİRİŞİ'!O7=\"\",\"\",'BİLGİ GİRİŞİ'!O7)","v":"BULANIK KAYMAKAMLIĞI"}]
[{"$f":"IF('BİLGİ GİRİŞİ'!O8=\"\",\"\",'BİLGİ GİRİŞİ'!O8)","v":"Atatürk İlkokulu Müdürlüğü"}]
[]
[]
[]
[{"$f":"IF('BİLGİ GİRİŞİ'!O11=\"\",\"\",CONCATENATE('BİLGİ GİRİŞİ'!O11,\" DOĞRUDAN TEMİN NUMARALI\"))","v":"22DT1211930 DOĞRUDAN TEMİN NUMARALI"}]
[{"$f":"UPPER(IF('BİLGİ GİRİŞİ'!O9=\"\",\"\",'BİLGİ GİRİŞİ'!O9))","v":"BİLİŞİM MALZEMELERİ ALIMI"}]
[]
[]
[]
["DOĞRUDAN TEMİN İŞLEM DOSYASI DİZİ PUSULASI"]
["S.N","Belge Adı",null,null,null,null,null,null,null,null,null,null,null,null,null,null,null,null,null,null,null,null,null,null,null,null,null,"Sayfa Sayısı"]
[1,"Ödeme Emri Belgesi",null,null,null,null,null,null,null,null,null,null,null,null,null,null,null,null,null,null,null,null,null,null,null,null,null,1]
[2,"Fatura",null,null,null,null,null,null,null,null,null,null,null,null,null,null,null,null,null,null,null,null,null,null,null,null,null,1]
[3,"Harcama Talimatı",null,null,null,null,null,null,null,null,null,null,null,null,null,null,null,null,null,null,null,null,null,null,null,null,null,1]
[4,"Taşınır İşlem Fişi",null,null,null,null,null,null,null,null,null,null,null,null,null,null,null,null,null,null,null,null,null,null,null,null,null,1]
[5,"Varlık İşlem Fişi",null,null,null,null,null,null,null,null,null,null,null,null,null,null,null,null,null,null,null,null,null,null,null,null,null,1]
[6,"Vergi Borcu Yok Belgesi (Yüklenici)",null,null,null,null,null,null,null,null,null,null,null,null,null,null,null,null,null,null,null,null,null,null,null,null,null,1]
[7,"Alım/Görevlendirme Onayı",null,null,null,null,null,null,null,null,null,null,null,null,null,null,null,null,null,null,null,null,null,null,null,null,null,1]
[8,"Yaklaşık Maliyet Araştırma (Piyasa Fiyatları) Belgeleri/Mektupları",null,null,null,null,null,null,null,null,null,null,null,null,null,null,null,null,null,null,null,null,null,null,null,null,null,3]
[9,"Doğrudan Temin Onay Belgesi ve Eki Yaklaşık Maliyet Hesap Cetveli",null,null,null,null,null,null,null,null,null,null,null,null,null,null,null,null,null,null,null,null,null,null,null,null,null,2]
[10,"Piyasa Fiyat Araştırma (Teklif Edilen Fiyalar) Belgeleri/Mektupları",null,null,null,null,null,null,null,null,null,null,null,null,null,null,null,null,null,null,null,null,null,null,null,null,null,3]
[11,"Muayene ve Kabul Tutanağı (Doğrudan Temin Sonuç Onay Belgesi) ve Eki Piyasa Fiyat Araştırma Tutanağı",null,null,null,null,null,null,null,null,null,null,null,null,null,null,null,null,null,null,null,null,null,null,null,null,null,2]
[]
[]
[]
[]
[]
["TOPLAM",null,null,null,null,null,null,null,null,null,null,null,null,null,null,null,null,null,null,null,null,null,null,null,null,null,null,{"$f":"SUM(AB17:AB27)","v":17}]
[]
[]
["İş Bu Dosya",null,null,{"$f":"(AB33)","v":17},null,"Sayfadan İbarettir."]
[]
[]
[]
[]
[{"$f":"IF('BİLGİ GİRİŞİ'!AT22=\"\",\"\",'BİLGİ GİRİŞİ'!AT22)","v":"Mustafa AYDIN"}]
[{"$f":"IF(A41=\"\",\"\",'BİLGİ GİRİŞİ'!AT23)","v":"Okul Müdürü"}]