{"text_format":"1","workbook":"xlsx","n_sheets":11,"sheets":["AÇIKLAMA","BİLGİ GİRİŞİ","1","2","3","4","5","6","7","8","KAPAK"],"not_rendered":{"charts":0,"images":5,"macros":1,"external_links":0,"defined_names":9,"comments":0,"pivot_tables":0},"unopened":[],"bounds":{"document_bytes":16777216,"sheet_cells":100000,"rows_first":2000,"rows_last":500,"rows_between":2000,"halvings":0,"cell_chars":16384,"cell_head_chars":4096},"cells_cut":0,"cells_raw":0,"read":"whole","date_system":"1900"}

{"sheet":"AÇIKLAMA","index":0,"n_rows":0,"n_cols":0,"rows_kept":0,"cut":false,"hidden":false,"merged":[]}

{"sheet":"BİLGİ GİRİŞİ","index":1,"n_rows":122,"n_cols":67,"rows_kept":122,"cut":false,"hidden":false,"merged":[[27,66,27,67],[12,27,12,34],[12,35,12,50],[11,27,11,34],[11,35,11,50],[9,3,9,13],[10,3,10,13],[6,3,6,13],[7,3,7,13],[8,3,8,13],[6,14,6,40],[8,14,8,40],[9,14,9,40],[10,14,10,40],[6,41,10,50],[12,4,12,13],[12,22,12,25],[12,18,12,21],[12,14,12,17],[7,14,7,38],[7,39,7,40],[18,3,19,3],[22,18,22,21],[22,22,22,25],[82,21,82,50],[82,3,82,19],[13,4,13,13],[13,14,13,17],[14,4,14,13],[13,3,14,3],[13,18,13,21],[13,22,13,25],[14,18,14,25],[66,4,66,18],[66,19,66,21],[65,22,65,24],[65,25,65,26],[65,27,65,30],[65,31,65,34],[65,35,65,38],[65,39,65,42],[65,43,65,46],[46,4,46,18],[46,19,46,21],[46,22,46,24],[67,47,67,50],[68,4,68,18],[68,19,68,21],[68,43,68,46],[68,47,68,50],[67,4,67,18],[67,19,67,21],[67,22,67,24],[67,25,67,26],[67,27,67,30],[67,31,67,34],[67,35,67,38],[67,39,67,42],[65,4,65,18],[65,19,65,21],[46,25,46,26],[46,27,46,30],[46,31,46,34],[46,35,46,38],[46,39,46,42],[46,43,46,46],[47,4,47,18],[47,19,47,21],[47,22,47,24],[47,25,47,26],[47,27,47,30],[47,31,47,34],[47,35,47,38],[47,39,47,42],[47,43,47,46],[60,4,60,18],[60,19,60,21],[60,22,60,24],[60,25,60,26],[60,27,60,30],[60,31,60,34],[60,35,60,38],[44,4,44,18],[44,19,44,21],[44,22,44,24],[44,25,44,26],[44,27,44,30],[44,31,44,34],[44,35,44,38],[44,39,44,42],[44,43,44,46],[45,4,45,18],[45,19,45,21],[45,22,45,24],[45,25,45,26],[45,27,45,30],[45,31,45,34],[45,35,45,38],[45,39,45,42],[45,43,45,46],[42,4,42,18],[42,19,42,21],[42,22,42,24],[42,25,42,26],[42,27,42,30],[42,31,42,34],[42,35,42,38],[42,39,42,42],[42,43,42,46],[43,4,43,18],[43,19,43,21],[43,22,43,24],[43,25,43,26],[43,27,43,30],[43,31,43,34],[43,35,43,38],[43,39,43,42],[43,43,43,46],[18,14,18,17],[19,14,19,17],[20,14,20,17],[17,18,17,21],[17,22,17,25],[18,18,18,21],[18,22,18,25],[20,22,20,25],[40,4,40,18],[40,19,40,21],[40,22,40,24],[40,25,40,26],[27,19,28,21],[27,22,28,24],[27,4,28,18],[19,4,19,13],[21,14,21,17],[22,14,22,17],[29,4,29,18],[32,22,32,24],[33,22,33,24],[34,22,34,24],[35,22,35,24],[31,19,31,21],[24,27,25,50],[24,3,25,26],[27,3,28,3],[27,25,28,26],[38,4,38,18],[38,19,38,21],[38,22,38,24],[38,25,38,26],[38,27,38,30],[38,31,38,34],[38,35,38,38],[38,39,38,42],[38,43,38,46],[29,25,29,26],[29,35,29,38],[29,39,29,42],[29,19,29,21],[30,19,30,21],[37,4,37,18],[30,4,30,18],[31,4,31,18],[32,4,32,18],[33,4,33,18],[37,19,37,21],[14,27,14,50],[21,39,21,44],[21,45,21,50],[20,45,20,50],[22,27,22,32],[22,33,22,38],[22,39,22,44],[22,45,22,50],[16,39,16,44],[17,39,17,44],[15,27,15,32],[15,33,15,38],[15,39,15,44],[20,27,20,32],[17,27,17,32],[16,45,16,50],[17,45,17,50],[15,45,15,50],[19,27,19,50],[16,27,16,32],[16,33,16,38],[17,33,17,38],[21,27,21,32],[21,33,21,38],[84,3,84,50],[101,3,101,50],[32,19,32,21],[33,19,33,21],[34,19,34,21],[35,19,35,21],[36,19,36,21],[74,39,74,42],[80,3,80,18],[74,19,74,21],[74,22,74,24],[74,25,74,26],[38,47,38,50],[39,4,39,18],[39,19,39,21],[39,22,39,24],[39,25,39,26],[40,47,40,50],[41,4,41,18],[41,19,41,21],[41,22,41,24],[41,25,41,26],[41,27,41,30],[41,31,41,34],[4,3,4,30],[26,27,26,50],[26,3,26,26],[19,18,19,25],[73,47,73,50],[74,4,74,18],[74,27,74,30],[74,31,74,34],[80,19,80,30],[21,18,21,21],[36,22,36,24],[37,22,37,24],[30,25,30,26],[31,25,31,26],[32,25,32,26],[33,25,33,26],[36,25,36,26],[37,25,37,26],[34,25,34,26],[21,22,21,25],[20,33,20,38],[20,39,20,44],[79,3,79,18],[79,19,79,30],[71,39,71,42],[71,43,71,46],[78,3,78,50],[76,3,76,26],[76,27,76,30],[76,31,76,34],[76,35,76,38],[76,39,76,42],[74,35,74,38],[71,47,71,50],[72,4,72,18],[72,27,72,30],[72,31,72,34],[72,35,72,38],[72,39,72,42],[72,43,72,46],[73,19,73,21],[73,22,73,24],[73,25,73,26],[71,19,71,21],[71,4,71,18],[71,27,71,30],[71,31,71,34],[71,35,71,38],[72,19,72,21],[71,22,71,24],[72,22,72,24],[71,25,71,26],[72,25,72,26],[73,4,73,18],[73,27,73,30],[73,31,73,34],[73,35,73,38],[59,4,59,18],[61,4,61,18],[72,47,72,50],[62,39,62,42],[62,43,62,46],[63,4,63,18],[63,19,63,21],[63,22,63,24],[63,25,63,26],[63,27,63,30],[63,31,63,34],[63,35,63,38],[63,39,63,42],[63,43,63,46],[64,31,64,34],[64,35,64,38],[64,39,64,42],[64,43,64,46],[69,4,69,18],[69,27,69,30],[69,31,69,34],[69,35,69,38],[69,19,69,21],[70,19,70,21],[61,19,61,21],[61,22,61,24],[61,27,61,30],[61,31,61,34],[61,35,61,38],[62,4,62,18],[62,19,62,21],[62,22,62,24],[62,25,62,26],[62,27,62,30],[62,31,62,34],[62,35,62,38],[27,43,27,50],[28,35,28,38],[28,39,28,42],[28,43,28,46],[28,47,28,50],[28,31,28,34],[27,27,27,34],[27,35,27,42],[29,31,29,34],[28,27,28,30],[29,27,29,30],[34,47,34,50],[35,47,35,50],[34,43,34,46],[35,27,35,30],[60,43,60,46],[60,47,60,50],[29,43,29,46],[29,22,29,24],[29,47,29,50],[34,31,34,34],[34,35,34,38],[34,39,34,42],[39,27,39,30],[39,31,39,34],[34,27,34,30],[30,22,30,24],[31,22,31,24],[57,47,57,50],[58,47,58,50],[57,39,57,42],[57,43,57,46],[57,31,57,34],[57,35,57,38],[59,39,59,42],[32,43,32,46],[32,47,32,50],[33,27,33,30],[33,31,33,34],[33,35,33,38],[33,39,33,42],[32,27,32,30],[32,31,32,34],[32,35,32,38],[32,39,32,42],[33,43,33,46],[33,47,33,50],[36,39,36,42],[36,47,36,50],[40,35,40,38],[40,39,40,42],[40,43,40,46],[35,43,35,46],[36,27,36,30],[36,31,36,34],[36,35,36,38],[36,43,36,46],[35,31,35,34],[30,47,30,50],[31,27,31,30],[31,31,31,34],[31,35,31,38],[31,39,31,42],[30,27,30,30],[30,31,30,34],[30,35,30,38],[30,39,30,42],[30,43,30,46],[31,43,31,46],[31,47,31,50],[48,27,48,30],[48,31,48,34],[48,35,48,38],[48,39,48,42],[37,43,37,46],[37,47,37,50],[55,43,55,46],[46,47,46,50],[47,47,47,50],[39,35,39,38],[39,39,39,42],[40,27,40,30],[40,31,40,34],[55,47,55,50],[48,47,48,50],[41,35,41,38],[41,39,41,42],[41,43,41,46],[41,47,41,50],[42,47,42,50],[43,47,43,50],[44,47,44,50],[45,47,45,50],[54,35,54,42],[70,27,70,30],[70,31,70,34],[56,19,56,21],[57,19,57,21],[49,39,49,42],[57,27,57,30],[56,22,56,24],[57,22,57,24],[60,39,60,42],[58,19,58,21],[59,19,59,21],[70,25,70,26],[56,25,56,26],[57,25,57,26],[58,22,58,24],[69,22,69,24],[49,27,49,30],[59,27,59,30],[59,31,59,34],[59,35,59,38],[66,27,66,30],[66,31,66,34],[66,35,66,38],[56,35,56,38],[54,3,55,3],[64,4,64,18],[70,22,70,24],[61,25,61,26],[66,22,66,24],[66,25,66,26],[59,22,59,24],[59,25,59,26],[49,31,49,34],[54,22,55,24],[54,19,55,21],[55,27,55,30],[54,25,55,26],[54,27,54,34],[55,31,55,34],[54,4,55,18],[58,4,58,18],[58,27,58,30],[57,4,57,18],[58,25,58,26],[64,19,64,21],[64,22,64,24],[64,25,64,26],[64,27,64,30],[55,35,55,38],[69,39,69,42],[58,31,58,34],[58,35,58,38],[58,39,58,42],[61,39,61,42],[69,25,69,26],[68,22,68,24],[68,25,68,26],[68,27,68,30],[68,31,68,34],[68,35,68,38],[68,39,68,42],[56,39,56,42],[70,35,70,38],[51,27,52,50],[51,3,52,26],[66,39,66,42],[66,43,66,46],[67,43,67,46],[70,4,70,18],[14,14,14,17],[56,4,56,18],[56,27,56,30],[56,31,56,34],[35,35,35,38],[35,39,35,42],[35,25,35,26],[34,4,34,18],[35,4,35,18],[36,4,36,18],[55,39,55,42],[53,3,53,26],[53,27,53,50],[49,3,49,26],[49,43,49,46],[20,4,20,13],[15,14,15,17],[16,14,16,17],[17,14,17,17],[20,18,20,21],[15,18,15,21],[15,22,15,25],[16,18,16,21],[16,22,16,25],[54,60,54,62],[54,57,54,59],[54,54,54,56],[49,35,49,38],[37,35,37,38],[37,39,37,42],[39,43,39,46],[39,47,39,50],[48,43,48,46],[37,27,37,30],[37,31,37,34],[49,47,49,50],[54,43,54,50],[48,4,48,18],[48,19,48,21],[48,22,48,24],[48,25,48,26],[79,31,79,34],[80,31,80,34],[79,35,79,38],[80,35,80,38],[79,39,79,42],[80,39,80,42],[79,47,79,50],[80,47,80,50],[79,43,79,46],[80,43,80,46],[56,43,56,46],[56,47,56,50],[70,39,70,42],[70,43,70,46],[70,47,70,50],[76,43,76,46],[76,47,76,50],[74,43,74,46],[74,47,74,50],[75,47,75,50],[59,43,59,46],[59,47,59,50],[69,47,69,50],[69,43,69,46],[58,43,58,46],[62,47,62,50],[63,47,63,50],[64,47,64,50],[65,47,65,50],[66,47,66,50],[61,43,61,46],[61,47,61,50],[73,39,73,42],[73,43,73,46],[75,4,75,18],[75,19,75,21],[75,22,75,24],[75,25,75,26],[75,27,75,30],[75,31,75,34],[75,35,75,38],[75,39,75,42],[75,43,75,46],[105,4,105,50],[106,4,106,50],[107,4,107,50],[108,4,108,50],[109,4,109,50],[85,4,85,50],[86,4,86,50],[87,4,87,50],[88,4,88,50],[89,4,89,50],[90,4,90,50],[91,4,91,50],[92,4,92,50],[19,69,20,71],[21,69,29,71],[117,4,117,50],[118,4,118,50],[119,4,119,50],[120,4,120,50],[121,4,121,50],[93,4,93,50],[96,4,96,50],[97,4,97,50],[98,4,98,50],[99,4,99,50],[95,4,95,50],[94,4,94,50],[110,4,110,50],[111,4,111,50],[112,4,112,50],[113,4,113,50],[114,4,114,50],[115,4,115,50],[116,4,116,50],[102,4,102,50],[103,4,103,50],[104,4,104,50]]}
[]
[]
[]
[]
[null,null,null,"DOĞRUDAN TEMİN PROGRAMI"]
[]
[null,null,null,"Üst İdare Adı",null,null,null,null,null,null,null,null,null,null,"BULANIK KAYMAKAMLIĞI"]
[null,null,null,"İdare Adı",null,null,null,null,null,null,null,null,null,null,"Atatürk İlkokulu Müdürlüğü",null,null,null,null,null,null,null,null,null,null,null,null,null,null,null,null,null,null,null,null,null,null,null,null,"ne"]
[null,null,null,"Mal/Hizmet/Yapım Adı, Niteliği ",null,null,null,null,null,null,null,null,null,null,"Bilişim Malzemeleri Alımı"]
[null,null,null,"Alım/Temin Usulü",null,null,null,null,null,null,null,null,null,null,"22/d"]
[null,null,null,"DTN (Doğrudan Temin Numarası)",null,null,null,null,null,null,null,null,null,null,"22DT1211930"]
[null,null,null,null,null,null,null,null,null,null,null,null,null,null,null,null,null,null,null,null,null,null,null,null,null,null,null,"Bütçe Tertibi",null,null,null,null,null,null,null,"6.98.255.9436.13.67.01.03.05.30.02"]
[null,null,null,"NO","BELGE ADI/ BELGE AÇ",null,null,null,null,null,null,null,null,null,"TARİHİ",null,null,null,"ÖNİZLEME",null,null,null,"YAZDIRMA",null,null,null,null,"Kullanılabilir Ödenek Tutarı",null,null,null,null,null,null,null,45000]
[null,null,null,1,"Alım/Görevlendirme Oluru"]
[null,null,null,null,"Alım/Görevlendirme Oluru Tarihi-Sayısı  >>",null,null,null,null,null,null,null,null,null,"2023-03-06",null,null,null,456789123,null,null,null,null,null,null,null,null,"PİYASA ARAŞTIRMA GÖREVLİLERİ"]
[null,null,null,2,"Yaklaşık Maliyet Araştırma Yazısı",null,null,null,null,null,null,null,null,null,"2023-03-06",null,null,null,null,null,null,null,null,null,null,null,null,"Piyasa Araştırma Görevlisi",null,null,null,null,null,"Piyasa Araştırma Görevlisi",null,null,null,null,null,"Piyasa Araştırma Görevlisi",null,null,null,null,null,"OLUR/UYGUNDUR"]
[null,null,null,3,"Yaklaşık Maliyet Hesap Cetveli",null,null,null,null,null,null,null,null,null,"2023-03-07",null,null,null,null,null,null,null,null,null,null,null,null,"Ahmet DEMİR",null,null,null,null,null,"Ayşe YILDIZ",null,null,null,null,null,null,null,null,null,null,null,"Mustafa AYDIN"]
[null,null,null,4,"Doğrudan Temin Onay Belgesi",null,null,null,null,null,null,null,null,null,"2023-03-06",null,null,null,null,null,null,null,null,null,null,null,null,"Müdür Yardımcısı 1",null,null,null,null,null,"Öğretmen 1",null,null,null,null,null,null,null,null,null,null,null,"Okul Müdürü"]
[null,null,null,5,"Teklif Vermeye Davet Yazısı",null,null,null,null,null,null,null,null,null,"2023-03-06"]
[null,null,null,null,"  Teklif Geçerlilik Tarihi                   >>",null,null,null,null,null,null,null,null,null,"2023-03-08",null,null,null,null,null,null,null,null,null,null,null,null,"MUAYENE VE KABUL GÖREVLİLERİ"]
[null,null,null,6,"İdari veTeknik Şartlar",null,null,null,null,null,null,null,null,null,null,null,null,null,null,null,null,null,null,null,null,null,null,"Muayene ve Kabul Görevlisi",null,null,null,null,null,"Muayene ve Kabul Görevlisi",null,null,null,null,null,"Muayene ve Kabul Görevlisi",null,null,null,null,null,"OLUR/UYGUNDUR"]
[null,null,null,7,"Piyasa Araştırma Tutanağı",null,null,null,null,null,null,null,null,null,"2023-03-08",null,null,null,null,null,null,null,null,null,null,null,null,"Mehmet  ÇELİK",null,null,null,null,null,"Fatma GÜNEŞ",null,null,null,null,null,null,null,null,null,null,null,"Mustafa AYDIN"]
[null,null,null,8,"Muayene ve Kabul Tutanağı",null,null,null,null,null,null,null,null,null,"2023-03-08",null,null,null,null,null,null,null,null,null,null,null,null,"Müdür Yardımcısı 2",null,null,null,null,null,"Öğretmen 2",null,null,null,null,null,null,null,null,null,null,null,"Okul Müdürü"]
[]
[null,null,null,null,null,null,null,null,null,null,null,null,null,null,null,null,null,null,null,null,null,null,null,null,null,null,null,"YAKLAŞIK MALİYET ARAŞTIRMASI"]
[]
[null,null,null,"MAL'IN/HİZMET'İN/YAPIM İŞİ'NİN",null,null,null,null,null,null,null,null,null,null,null,null,null,null,null,null,null,null,null,null,null,null,null,"ARAŞTIRMA YAPILAN KİŞİLER/FİRMALAR VE VERDİKLERİ FİYATLAR (KDV HARİÇ)"]
[null,null,null,"S",{"$f":"IF((COUNTIF(BA30:BA49,\"*x*\"))>=1,\"Bu alanda (x ile işaretlenen satırda) hücrelerin birinde veya birkaçında fazla veri var! Siliniz!\",\"ADI\")","v":"ADI"},null,null,null,null,null,null,null,null,null,null,null,null,null,null,"MİKTARI",null,null,"BİRİMİ",null,null,"KDV\n(%)",null,"A GERÇEK/TÜZEL KİŞİSİ",null,null,null,null,null,null,null,"B GERÇEK/TÜZEL KİŞİSİ",null,null,null,null,null,null,null,"C GERÇEK/TÜZEL KİŞİSİ",null,null,null,null,null,null,null,null,null,null,null,null,null,null,null,null,null,null,null,null,null,1,1]
[null,null,null,null,null,null,null,null,null,null,null,null,null,null,null,null,null,null,null,null,null,null,null,null,null,null,null,"Birim Fiyatı",null,null,null,"Toplam Fiyatı",null,null,null,"Birim Fiyatı",null,null,null,"Toplam Fiyatı",null,null,null,"Birim Fiyatı",null,null,null,"Toplam Fiyatı "]
[null,null,null,{"$f":"IF(E30=\"\",\"\",1)","v":1},"AIO (All In One) Masaüstü Bilgisayar ",null,null,null,null,null,null,null,null,null,null,null,null,null,null,20,null,null,"Adet",null,null,20,null,14000,null,null,null,{"$f":"IF(AB30=\"\",\"\",T30*AB30)","v":280000},null,null,null,12000,null,null,null,{"$f":"IF(AJ30=\"\",\"\",T30*AJ30)","v":240000},null,null,null,13000,null,null,null,{"$f":"IF(AR30=\"\",\"\",T30*AR30)","v":260000},null,null,null,null,{"$f":"IF(E30=\"\",IF(OR(T30<>\"\",W30<>\"\",Z30<>\"\",AB30<>\"\",AJ30<>\"\",AR30<>\"\"),\"x\",\"\"),\"✓\")","v":"✓"}]
[null,null,null,{"$f":"IF(E31=\"\",\"\",2)","v":2},"Fotokopi Makinesi",null,null,null,null,null,null,null,null,null,null,null,null,null,null,10,null,null,"Adet",null,null,10,null,11000,null,null,null,{"$f":"IF(AB31=\"\",\"\",T31*AB31)","v":110000},null,null,null,9000,null,null,null,{"$f":"IF(AJ31=\"\",\"\",T31*AJ31)","v":90000},null,null,null,10000,null,null,null,{"$f":"IF(AR31=\"\",\"\",T31*AR31)","v":100000},null,null,null,null,{"$f":"IF(E31=\"\",IF(OR(T31<>\"\",W31<>\"\",Z31<>\"\",AB31<>\"\",AJ31<>\"\",AR31<>\"\"),\"x\",\"\"),\"✓\")","v":"✓"}]
[null,null,null,{"$f":"IF(E32=\"\",\"\",3)","v":3},"Projektör",null,null,null,null,null,null,null,null,null,null,null,null,null,null,4,null,null,"Adet",null,null,1,null,8000,null,null,null,32000,null,null,null,6000,null,null,null,24000,null,null,null,7000,null,null,null,28000,null,null,null,null,"✓"]
[null,null,null,{"$f":"IF(E33=\"\",\"\",4)","v":""},null,null,null,null,null,null,null,null,null,null,null,null,null,null,null,null,null,null,null,null,null,null,null,null,null,null,null,"",null,null,null,null,null,null,null,"",null,null,null,null,null,null,null,"",null,null,null,null,""]
[null,null,null,{"$f":"IF(E34=\"\",\"\",5)","v":""},null,null,null,null,null,null,null,null,null,null,null,null,null,null,null,null,null,null,null,null,null,null,null,null,null,null,null,"",null,null,null,null,null,null,null,"",null,null,null,null,null,null,null,"",null,null,null,null,""]
[null,null,null,{"$f":"IF(E35=\"\",\"\",6)","v":""},null,null,null,null,null,null,null,null,null,null,null,null,null,null,null,null,null,null,null,null,null,null,null,null,null,null,null,"",null,null,null,null,null,null,null,"",null,null,null,null,null,null,null,"",null,null,null,null,""]
[null,null,null,{"$f":"IF(E36=\"\",\"\",7)","v":""},null,null,null,null,null,null,null,null,null,null,null,null,null,null,null,null,null,null,null,null,null,null,null,null,null,null,null,"",null,null,null,null,null,null,null,"",null,null,null,null,null,null,null,"",null,null,null,null,""]
[null,null,null,{"$f":"IF(E37=\"\",\"\",8)","v":""},null,null,null,null,null,null,null,null,null,null,null,null,null,null,null,null,null,null,null,null,null,null,null,null,null,null,null,"",null,null,null,null,null,null,null,"",null,null,null,null,null,null,null,"",null,null,null,null,""]
[null,null,null,{"$f":"IF(E38=\"\",\"\",9)","v":""},null,null,null,null,null,null,null,null,null,null,null,null,null,null,null,null,null,null,null,null,null,null,null,null,null,null,null,"",null,null,null,null,null,null,null,"",null,null,null,null,null,null,null,"",null,null,null,null,""]
[null,null,null,{"$f":"IF(E39=\"\",\"\",10)","v":""},null,null,null,null,null,null,null,null,null,null,null,null,null,null,null,null,null,null,null,null,null,null,null,null,null,null,null,"",null,null,null,null,null,null,null,"",null,null,null,null,null,null,null,"",null,null,null,null,""]
[null,null,null,{"$f":"IF(E40=\"\",\"\",11)","v":""},null,null,null,null,null,null,null,null,null,null,null,null,null,null,null,null,null,null,null,null,null,null,null,null,null,null,null,"",null,null,null,null,null,null,null,"",null,null,null,null,null,null,null,"",null,null,null,null,""]
[null,null,null,{"$f":"IF(E41=\"\",\"\",12)","v":""},null,null,null,null,null,null,null,null,null,null,null,null,null,null,null,null,null,null,null,null,null,null,null,null,null,null,null,"",null,null,null,null,null,null,null,"",null,null,null,null,null,null,null,"",null,null,null,null,""]
[null,null,null,{"$f":"IF(E42=\"\",\"\",13)","v":""},null,null,null,null,null,null,null,null,null,null,null,null,null,null,null,null,null,null,null,null,null,null,null,null,null,null,null,"",null,null,null,null,null,null,null,"",null,null,null,null,null,null,null,"",null,null,null,null,""]
[null,null,null,{"$f":"IF(E43=\"\",\"\",14)","v":""},null,null,null,null,null,null,null,null,null,null,null,null,null,null,null,null,null,null,null,null,null,null,null,null,null,null,null,"",null,null,null,null,null,null,null,"",null,null,null,null,null,null,null,"",null,null,null,null,""]
[null,null,null,{"$f":"IF(E44=\"\",\"\",15)","v":""},null,null,null,null,null,null,null,null,null,null,null,null,null,null,null,null,null,null,null,null,null,null,null,null,null,null,null,"",null,null,null,null,null,null,null,"",null,null,null,null,null,null,null,"",null,null,null,null,""]
[null,null,null,{"$f":"IF(E45=\"\",\"\",16)","v":""},null,null,null,null,null,null,null,null,null,null,null,null,null,null,null,null,null,null,null,null,null,null,null,null,null,null,null,"",null,null,null,null,null,null,null,"",null,null,null,null,null,null,null,"",null,null,null,null,""]
[null,null,null,{"$f":"IF(E46=\"\",\"\",17)","v":""},null,null,null,null,null,null,null,null,null,null,null,null,null,null,null,null,null,null,null,null,null,null,null,null,null,null,null,"",null,null,null,null,null,null,null,"",null,null,null,null,null,null,null,"",null,null,null,null,""]
[null,null,null,{"$f":"IF(E47=\"\",\"\",18)","v":""},null,null,null,null,null,null,null,null,null,null,null,null,null,null,null,null,null,null,null,null,null,null,null,null,null,null,null,"",null,null,null,null,null,null,null,"",null,null,null,null,null,null,null,"",null,null,null,null,""]
[null,null,null,{"$f":"IF(E48=\"\",\"\",19)","v":""},null,null,null,null,null,null,null,null,null,null,null,null,null,null,null,null,null,null,null,null,null,null,null,null,null,null,null,"",null,null,null,null,null,null,null,"",null,null,null,null,null,null,null,"",null,null,null,null,""]
[null,null,null,{"$f":"IF(E49=\"\",\"\",20)","v":""},null,null,null,null,null,null,null,null,null,null,null,null,null,null,null,null,null,null,null,null,null,null,null,null,null,null,null,"",null,null,null,null,null,null,null,"",null,null,null,null,null,null,null,"",null,null,null,null,""]
[null,null,null,"TOPLAM (KDV Hariç)",null,null,null,null,null,null,null,null,null,null,null,null,null,null,null,null,null,null,null,null,null,null,null,{"$f":"SUM(AB30:AB49)","v":33000},null,null,null,{"$f":"SUM(AF30:AF49)","v":422000},null,null,null,{"$f":"SUM(AJ30:AJ49)","v":27000},null,null,null,{"$f":"SUM(AN30:AN49)","v":354000},null,null,null,{"$f":"SUM(AR30:AR49)","v":30000},null,null,null,{"$f":"SUM(AV30:AV49)","v":388000}]
[]
[null,null,null,null,null,null,null,null,null,null,null,null,null,null,null,null,null,null,null,null,null,null,null,null,null,null,null,"PİYASA FİYAT ARAŞTIRMASI"]
[]
[null,null,null,"MAL'IN/HİZMET'İN/YAPIM İŞİ'NİN",null,null,null,null,null,null,null,null,null,null,null,null,null,null,null,null,null,null,null,null,null,null,null,"TEKLİF VEREN KİŞİLER/FİRMALAR VE TEKLİF FİYATLARI (KDV HARİÇ)"]
[null,null,null,"S",{"$f":"IF((COUNTIF(BA57:BA76,\"*x*\"))>=1,\"Bu alanda (x ile işaretlenen satırda) hücrelerin birinde veya birkaçında fazla veri var! Siliniz!\",\"ADI\")","v":"ADI"},null,null,null,null,null,null,null,null,null,null,null,null,null,null,"BİRİMİ",null,null,"MİKTARI",null,null,"KDV\n(%)",null,"A GERÇEK/TÜZEL KİŞİSİ",null,null,null,null,null,null,null,"B GERÇEK/TÜZEL KİŞİSİ",null,null,null,null,null,null,null,"D GERÇEK/TÜZEL KİŞİSİ",null,null,null,null,null,null,null,null,null,null,{"$f":"AB55","v":"A GERÇEK/TÜZEL KİŞİSİ"},null,null,{"$f":"AJ55","v":"B GERÇEK/TÜZEL KİŞİSİ"},null,null,{"$f":"AR55","v":"D GERÇEK/TÜZEL KİŞİSİ"}]
[null,null,null,null,null,null,null,null,null,null,null,null,null,null,null,null,null,null,null,null,null,null,null,null,null,null,null,"Birim Fiyatı",null,null,null,"Toplam Fiyatı",null,null,null,"Birim Fiyatı",null,null,null,"Toplam Fiyatı",null,null,null,"Birim Fiyatı",null,null,null,"Toplam Fiyatı",null,null,null,null,null,null,20,10,1,20,10,1,20,10,1]
[null,null,null,{"$f":"IF(D30=\"\",\"\",D30)","v":1},{"$f":"IF(E30=\"\",\"\",E30)","v":"AIO (All In One) Masaüstü Bilgisayar "},null,null,null,null,null,null,null,null,null,null,null,null,null,null,{"$f":"IF(T30=\"\",\"\",T30)","v":20},null,null,{"$f":"IF(W30=\"\",\"\",W30)","v":"Adet"},null,null,{"$f":"IF(Z30=\"\",\"\",Z30)","v":20},null,13000,null,null,null,{"$f":"IF(AB57=\"\",\"\",T57*AB57)","v":260000},null,null,null,11000,null,null,null,{"$f":"IF(AJ57=\"\",\"\",T57*AJ57)","v":220000},null,null,null,12000,null,null,null,{"$f":"IF(AR57=\"\",\"\",T57*AR57)","v":240000},null,null,null,null,{"$f":"IF(E57=\"\",IF(OR(AB57<>\"\",AJ57<>\"\",AR57<>\"\"),\"x\",\"\"),\"✓\")","v":"✓"},null,{"$f":"IF(AF57=\"\",\"\",IF(Z57=20,(AF57*20/100),\"\"))","v":52000},{"$f":"IF(AF57=\"\",\"\",IF(Z57=10,(AF57*10/100),\"0\"))","v":"0"},{"$f":"IF(AF57=\"\",\"\",IF(Z57=1,(AF57*1/100),\"\"))","v":""},{"$f":"IF(AN57=\"\",\"\",IF(Z57=20,(AN57*20/100),\"\"))","v":44000},{"$f":"IF(AN57=\"\",\"\",IF(Z57=10,(AN57*10/100),\"\"))","v":""},{"$f":"IF(AN57=\"\",\"\",IF(Z57=1,(AN57*1/100),\"\"))","v":""},{"$f":"IF(AV57=\"\",\"\",IF(Z57=20,(AV57*20/100),\"\"))","v":48000},{"$f":"IF(AV57=\"\",\"\",IF(Z57=10,(AV57*10/100),\"\"))","v":""},{"$f":"IF(AV57=\"\",\"\",IF(Z57=1,(AV57*1/100),\"\"))","v":""}]
[null,null,null,{"$f":"IF(D31=\"\",\"\",D31)","v":2},{"$f":"IF(E31=\"\",\"\",E31)","v":"Fotokopi Makinesi"},null,null,null,null,null,null,null,null,null,null,null,null,null,null,{"$f":"IF(T31=\"\",\"\",T31)","v":10},null,null,{"$f":"IF(W31=\"\",\"\",W31)","v":"Adet"},null,null,{"$f":"IF(Z31=\"\",\"\",Z31)","v":10},null,10000,null,null,null,{"$f":"IF(AB58=\"\",\"\",T58*AB58)","v":100000},null,null,null,9000,null,null,null,{"$f":"IF(AJ58=\"\",\"\",T58*AJ58)","v":90000},null,null,null,9000,null,null,null,{"$f":"IF(AR58=\"\",\"\",T58*AR58)","v":90000},null,null,null,null,{"$f":"IF(E58=\"\",IF(OR(AB58<>\"\",AJ58<>\"\",AR58<>\"\"),\"x\",\"\"),\"✓\")","v":"✓"},null,{"$f":"IF(AF58=\"\",\"\",IF(Z58=20,(AF58*20/100),\"\"))","v":""},{"$f":"IF(AF58=\"\",\"\",IF(Z58=10,(AF58*10/100),\"0\"))","v":10000},{"$f":"IF(AF58=\"\",\"\",IF(Z58=1,(AF58*1/100),\"\"))","v":""},{"$f":"IF(AN58=\"\",\"\",IF(Z58=20,(AN58*20/100),\"\"))","v":""},{"$f":"IF(AN58=\"\",\"\",IF(Z58=10,(AN58*10/100),\"\"))","v":9000},{"$f":"IF(AN58=\"\",\"\",IF(Z58=1,(AN58*1/100),\"\"))","v":""},{"$f":"IF(AV58=\"\",\"\",IF(Z58=20,(AV58*20/100),\"\"))","v":""},{"$f":"IF(AV58=\"\",\"\",IF(Z58=10,(AV58*10/100),\"\"))","v":9000},{"$f":"IF(AV58=\"\",\"\",IF(Z58=1,(AV58*1/100),\"\"))","v":""}]
[null,null,null,3,"Projektör",null,null,null,null,null,null,null,null,null,null,null,null,null,null,4,null,null,"Adet",null,null,1,null,7000,null,null,null,28000,null,null,null,6000,null,null,null,24000,null,null,null,7000,null,null,null,28000,null,null,null,null,"✓",null,"","0",280,"","",240,"","",280]
[null,null,null,"","",null,null,null,null,null,null,null,null,null,null,null,null,null,null,"",null,null,"",null,null,"",null,null,null,null,null,"",null,null,null,null,null,null,null,"",null,null,null,null,null,null,null,"",null,null,null,null,"",null,{"$f":"IF(AF60=\"\",\"\",IF(Z60=20,(AF60*20/100),\"\"))","v":""},"","","","","",{"$f":"IF(AV60=\"\",\"\",IF(Z60=20,(AV60*20/100),\"\"))","v":""},"",""]
[null,null,null,"","",null,null,null,null,null,null,null,null,null,null,null,null,null,null,"",null,null,"",null,null,"",null,null,null,null,null,"",null,null,null,null,null,null,null,"",null,null,null,null,null,null,null,"",null,null,null,null,"",null,"","","","","","","","",""]
[null,null,null,"","",null,null,null,null,null,null,null,null,null,null,null,null,null,null,"",null,null,"",null,null,"",null,null,null,null,null,"",null,null,null,null,null,null,null,"",null,null,null,null,null,null,null,"",null,null,null,null,"",null,"","","","","","","","",""]
[null,null,null,"","",null,null,null,null,null,null,null,null,null,null,null,null,null,null,"",null,null,"",null,null,"",null,null,null,null,null,"",null,null,null,null,null,null,null,"",null,null,null,null,null,null,null,"",null,null,null,null,"",null,"","","","","","","","",""]
[null,null,null,"","",null,null,null,null,null,null,null,null,null,null,null,null,null,null,"",null,null,"",null,null,"",null,null,null,null,null,"",null,null,null,null,null,null,null,"",null,null,null,null,null,null,null,"",null,null,null,null,"",null,"","","","","","","","",""]
[null,null,null,"","",null,null,null,null,null,null,null,null,null,null,null,null,null,null,"",null,null,"",null,null,"",null,null,null,null,null,"",null,null,null,null,null,null,null,"",null,null,null,null,null,null,null,"",null,null,null,null,"",null,"","","","","","","","",""]
[null,null,null,"","",null,null,null,null,null,null,null,null,null,null,null,null,null,null,"",null,null,"",null,null,"",null,null,null,null,null,"",null,null,null,null,null,null,null,"",null,null,null,null,null,null,null,"",null,null,null,null,"",null,"","","","","","","","",""]
[null,null,null,"","",null,null,null,null,null,null,null,null,null,null,null,null,null,null,"",null,null,"",null,null,"",null,null,null,null,null,"",null,null,null,null,null,null,null,"",null,null,null,null,null,null,null,"",null,null,null,null,"",null,"","","","","","","","",""]
[null,null,null,"","",null,null,null,null,null,null,null,null,null,null,null,null,null,null,"",null,null,"",null,null,"",null,null,null,null,null,"",null,null,null,null,null,null,null,"",null,null,null,null,null,null,null,"",null,null,null,null,"",null,"","","","","","","","",""]
[null,null,null,"","",null,null,null,null,null,null,null,null,null,null,null,null,null,null,"",null,null,"",null,null,"",null,null,null,null,null,"",null,null,null,null,null,null,null,"",null,null,null,null,null,null,null,"",null,null,null,null,"",null,"","","","","","","","",""]
[null,null,null,"","",null,null,null,null,null,null,null,null,null,null,null,null,null,null,"",null,null,"",null,null,"",null,null,null,null,null,"",null,null,null,null,null,null,null,"",null,null,null,null,null,null,null,"",null,null,null,null,"",null,"","","","","","","","",""]
[null,null,null,"","",null,null,null,null,null,null,null,null,null,null,null,null,null,null,"",null,null,"",null,null,"",null,null,null,null,null,"",null,null,null,null,null,null,null,"",null,null,null,null,null,null,null,"",null,null,null,null,"",null,"","","","","","","","",""]
[null,null,null,"","",null,null,null,null,null,null,null,null,null,null,null,null,null,null,"",null,null,"",null,null,"",null,null,null,null,null,"",null,null,null,null,null,null,null,"",null,null,null,null,null,null,null,"",null,null,null,null,"",null,"","","","","","","","",""]
[null,null,null,"","",null,null,null,null,null,null,null,null,null,null,null,null,null,null,"",null,null,"",null,null,"",null,null,null,null,null,"",null,null,null,null,null,null,null,"",null,null,null,null,null,null,null,"",null,null,null,null,"",null,"","","","","","","","",""]
[null,null,null,"","",null,null,null,null,null,null,null,null,null,null,null,null,null,null,"",null,null,"",null,null,"",null,null,null,null,null,"",null,null,null,null,null,null,null,"",null,null,null,null,null,null,null,"",null,null,null,null,"",null,"","","","","","","","",""]
[null,null,null,"","",null,null,null,null,null,null,null,null,null,null,null,null,null,null,"",null,null,"",null,null,"",null,null,null,null,null,"",null,null,null,null,null,null,null,"",null,null,null,null,null,null,null,"",null,null,null,null,"",null,"","","","","","","","",""]
[null,null,null,"","",null,null,null,null,null,null,null,null,null,null,null,null,null,null,"",null,null,"",null,null,"",null,null,null,null,null,"",null,null,null,null,null,null,null,"",null,null,null,null,null,null,null,"",null,null,null,null,"",null,"","","","","","","","",""]
[null,null,null,"TOPLAM",null,null,null,null,null,null,null,null,null,null,null,null,null,null,null,null,null,null,null,null,null,null,null,{"$f":"SUM(AB57:AB76)","v":30000},null,null,null,{"$f":"SUM(AF57:AF76)","v":388000},null,null,null,{"$f":"SUM(AJ57:AJ76)","v":26000},null,null,null,{"$f":"SUM(AN57:AN76)","v":334000},null,null,null,{"$f":"SUM(AR57:AR76)","v":28000},null,null,null,{"$f":"SUM(AV57:AV76)","v":358000},null,null,null,null,null,null,{"$f":"SUM(BC57:BC76)","v":52000},10000,280,44000,9000,240,48000,9000,280]
[]
[null,null,null,"EN UYGUN (DÜŞÜK) TEKLİFİ VEREN KİŞİ/FİRMA"]
[null,null,null,"ADI",null,null,null,null,null,null,null,null,null,null,null,null,null,null,null,"ADRESİ",null,null,null,null,null,null,null,null,null,null,null,"TEKLİFİ",null,null,null,"KDV (%20)",null,null,null,"KDV (%10)",null,null,null,"KDV (%1)",null,null,null,"TOPLAM"]
[null,null,null,{"$f":"IF(AND(AF77<AN77,AF77<AV77),AB55,(IF(AND(AN77<AF77,AN77<AV77),AJ55,(IF(AND(AV77<AF77,AV77<AN77),AR55,\"\")))))","v":"B GERÇEK/TÜZEL KİŞİSİ"},null,null,null,null,null,null,null,null,null,null,null,null,null,null,null,"Bulanık/MUŞ",null,null,null,null,null,null,null,null,null,null,null,{"$f":"IF(D81=AB55,AF77,IF(D81=AJ55,AN77,IF(D81=AR55,AV77,\"\")))","v":334000},null,null,null,{"$f":"IF(D81=AB55,BC77,IF(D81=AJ55,BF77,IF(D81=AR55,BI77,\"\")))","v":44000},null,null,null,{"$f":"IF(D81=AB55,BD77,IF(D81=AJ55,BG77,IF(D81=AR55,BJ77,\"\")))","v":9000},null,null,null,{"$f":"IF(D81=AB55,BE77,IF(D81=AJ55,BH77,IF(D81=AR55,BK77,\"\")))","v":240},null,null,null,{"$f":"IF(D81=\"\",\"\",(AF81+AJ81+AN81+AR81))","v":387240}]
[]
[null,null,null,null,null,null,null,null,null,null,null,null,null,null,null,null,null,null,null,null,null,"Birim Fiyat Teklif Mektuplarına Şartlar Eklenecekse Aşağıdaki Alanlara Şartlar Girilecektir.  Aksi durumda silinmelidir."]
[]
[null,null,null,"     İDARİ ŞARTLAR"]
[null,null,null,{"$f":"IF(E86=\"\",\"\",1)","v":1},"Bu bent boş bırakılmıştır."]
[null,null,null,{"$f":"IF(E87=\"\",\"\",2)","v":""}]
[null,null,null,{"$f":"IF(E88=\"\",\"\",3)","v":""}]
[null,null,null,{"$f":"IF(E89=\"\",\"\",4)","v":""}]
[null,null,null,{"$f":"IF(E90=\"\",\"\",5)","v":""}]
[null,null,null,{"$f":"IF(E91=\"\",\"\",6)","v":""}]
[null,null,null,{"$f":"IF(E92=\"\",\"\",7)","v":""}]
[null,null,null,{"$f":"IF(E93=\"\",\"\",8)","v":""}]
[null,null,null,{"$f":"IF(E94=\"\",\"\",9)","v":""}]
[null,null,null,{"$f":"IF(E95=\"\",\"\",10)","v":""}]
[null,null,null,{"$f":"IF(E96=\"\",\"\",11)","v":""}]
[null,null,null,{"$f":"IF(E97=\"\",\"\",12)","v":""}]
[null,null,null,{"$f":"IF(E98=\"\",\"\",13)","v":""}]
[null,null,null,{"$f":"IF(E99=\"\",\"\",14)","v":""}]
[null,null,null,{"$f":"IF(E100=\"\",\"\",15)","v":""}]
[]
[null,null,null,"    TEKNİK ŞARTLAR"]
[null,null,null,{"$f":"IF(E103=\"\",\"\",1)","v":1},"Bu bent boş bırakılmıştır."]
[null,null,null,{"$f":"IF(E104=\"\",\"\",D103+1)","v":""}]
[null,null,null,{"$f":"IF(E105=\"\",\"\",3)","v":""}]
[null,null,null,{"$f":"IF(E106=\"\",\"\",4)","v":""}]
[null,null,null,{"$f":"IF(E107=\"\",\"\",5)","v":""}]
[null,null,null,{"$f":"IF(E108=\"\",\"\",6)","v":""}]
[null,null,null,{"$f":"IF(E109=\"\",\"\",7)","v":""}]
[null,null,null,{"$f":"IF(E110=\"\",\"\",8)","v":""}]
[null,null,null,{"$f":"IF(E111=\"\",\"\",9)","v":""}]
[null,null,null,{"$f":"IF(E112=\"\",\"\",10)","v":""}]
[null,null,null,{"$f":"IF(E113=\"\",\"\",11)","v":""}]
[null,null,null,{"$f":"IF(E114=\"\",\"\",12)","v":""}]
[null,null,null,{"$f":"IF(E115=\"\",\"\",13)","v":""}]
[null,null,null,{"$f":"IF(E116=\"\",\"\",14)","v":""}]
[null,null,null,{"$f":"IF(E117=\"\",\"\",15)","v":""}]
[null,null,null,{"$f":"IF(E118=\"\",\"\",16)","v":""}]
[null,null,null,{"$f":"IF(E119=\"\",\"\",17)","v":""}]
[null,null,null,{"$f":"IF(E120=\"\",\"\",18)","v":""}]
[null,null,null,{"$f":"IF(E121=\"\",\"\",19)","v":""}]
[null,null,null,{"$f":"IF(E122=\"\",\"\",20)","v":""}]

{"sheet":"1","index":2,"n_rows":55,"n_cols":28,"rows_kept":55,"cut":false,"hidden":false,"merged":[[17,19,17,30],[1,0,1,30],[2,0,2,30],[3,0,3,30],[5,0,5,2],[5,4,5,19],[5,24,5,30],[6,0,6,2],[6,4,6,26],[9,0,9,30],[11,0,15,30],[16,19,16,30],[20,9,20,21],[22,9,22,21],[25,0,25,30],[26,1,26,22],[26,23,26,26],[26,27,26,30],[21,9,21,21],[27,1,27,22],[27,27,27,30],[27,23,27,26],[28,1,28,22],[28,27,28,30],[28,23,28,26],[29,1,29,22],[29,27,29,30],[29,23,29,26],[30,1,30,22],[30,23,30,26],[30,27,30,30],[31,1,31,22],[31,23,31,26],[31,27,31,30],[32,1,32,22],[32,23,32,26],[32,27,32,30],[33,1,33,22],[33,23,33,26],[33,27,33,30],[34,1,34,22],[34,23,34,26],[34,27,34,30],[35,1,35,22],[35,23,35,26],[35,27,35,30],[36,1,36,22],[36,23,36,26],[36,27,36,30],[37,1,37,22],[37,23,37,26],[37,27,37,30],[38,1,38,22],[38,23,38,26],[38,27,38,30],[39,1,39,22],[39,23,39,26],[39,27,39,30],[40,1,40,22],[40,23,40,26],[40,27,40,30],[41,1,41,22],[41,23,41,26],[41,27,41,30],[42,1,42,22],[42,23,42,26],[42,27,42,30],[43,1,43,22],[43,23,43,26],[43,27,43,30],[44,1,44,22],[44,23,44,26],[44,27,44,30],[45,1,45,22],[45,23,45,26],[45,27,45,30],[46,1,46,22],[46,23,46,26],[46,27,46,30],[48,0,48,30],[49,0,49,9],[49,10,49,20],[49,21,49,30],[50,0,50,9],[50,10,50,20],[50,21,50,30],[52,0,52,30],[53,0,53,9],[53,10,53,20],[53,21,53,30],[54,0,54,9],[54,10,54,20],[54,21,54,30]]}
[]
["T.C."]
[{"$f":"IF('BİLGİ GİRİŞİ'!O7=\"\",\"\",'BİLGİ GİRİŞİ'!O7)","v":"BULANIK KAYMAKAMLIĞI"}]
[{"$f":"IF('BİLGİ GİRİŞİ'!O8=\"\",\"\",'BİLGİ GİRİŞİ'!O8)","v":"Atatürk İlkokulu Müdürlüğü"}]
[]
["Sayı",null,null,":",{"$f":"IF('BİLGİ GİRİŞİ'!S15=\"\",\"\",'BİLGİ GİRİŞİ'!S15)","v":456789123},null,null,null,null,null,null,null,null,null,null,null,null,null,null,null,null,null,null,null,{"$f":"IF('BİLGİ GİRİŞİ'!O15=\"\",\"…../…../……..\",'BİLGİ GİRİŞİ'!O15)","v":"2023-03-06"}]
["Konu",null,null,":","Mal Alımı/Hizmet Alımı/Yapım İşi"]
[]
[]
[{"$f":"IF('BİLGİ GİRİŞİ'!O8=\"\",\"\",CONCATENATE(UPPER('BİLGİ GİRİŞİ'!O8),\" \nHARCAMA YETKİLİSİ MAKAMINA\",))","v":"ATATÜRK İLKOKULU MÜDÜRLÜĞÜ \nHARCAMA YETKİLİSİ MAKAMINA"}]
[]
[{"$f":"CONCATENATE(\"       \",\"Kurumumuz ihtiyaçlarında kullanılmak üzere aşağıda bilgileri verilen  Mal'ın/Hizmet'in/Yapım İşi'nin Kamu İhale Kanunu'nun \",IF('BİLGİ GİRİŞİ'!O10=\"\",\".............................................................................\",'BİLGİ GİRİŞİ'!O10),\" Maddesine göre Doğrudan Temin yoluyla satın alınması ve aşağıda bilgileri verilen personellerin piyasa araştırma , muayene ve kabul görevlisi olarak görevlendirilmesi hususunu;\n       Olurlarınıza arz ederim/ederiz.\")","v":"       Kurumumuz ihtiyaçlarında kullanılmak üzere aşağıda bilgileri verilen  Mal'ın/Hizmet'in/Yapım İşi'nin Kamu İhale Kanunu'nun 22/d Maddesine göre Doğrudan Temin yoluyla satın alınması ve aşağıda bilgileri verilen personellerin piyasa araştırma , muayene ve kabul görevlisi olarak görevlendirilmesi hususunu;\n       Olurlarınıza arz ederim/ederiz."}]
[]
[]
[]
[]
[null,null,null,null,null,null,null,null,null,null,null,null,null,null,null,null,null,null,null,{"$f":"IF('BİLGİ GİRİŞİ'!AB17=\"\",\"\",'BİLGİ GİRİŞİ'!AB17)","v":"Ahmet DEMİR"}]
[null,null,null,null,null,null,null,null,null,null,null,null,null,null,null,null,null,null,null,{"$f":"IF(T17=\"\",\"\",IF('BİLGİ GİRİŞİ'!AB18=\"\",\"\",'BİLGİ GİRİŞİ'!AB18))","v":"Müdür Yardımcısı 1"}]
[]
[]
[null,null,null,null,null,null,null,null,null,{"$f":"IF(J22=\"\",\"\",IF('BİLGİ GİRİŞİ'!AT16=\"\",\"\",'BİLGİ GİRİŞİ'!AT16))","v":"OLUR/UYGUNDUR"}]
[null,null,null,null,null,null,null,null,null,{"$f":"IF('BİLGİ GİRİŞİ'!AT17=\"\",\"\",'BİLGİ GİRİŞİ'!AT17)","v":"Mustafa AYDIN"}]
[null,null,null,null,null,null,null,null,null,{"$f":"IF(J22=\"\",\"\",IF('BİLGİ GİRİŞİ'!AT18=\"\",\"\",'BİLGİ GİRİŞİ'!AT18))","v":"Okul Müdürü"}]
[]
[]
["MAL'IN/HİZMET'İN/YAPIM İŞİ'NİN"]
["S","Kalem/KısımBilgileri",null,null,null,null,null,null,null,null,null,null,null,null,null,null,null,null,null,null,null,null,null,"Birimi",null,null,null,"Miktarı"]
[{"$f":"IF('BİLGİ GİRİŞİ'!D30=\"\",\"\",'BİLGİ GİRİŞİ'!D30)","v":1},{"$f":"IF('BİLGİ GİRİŞİ'!E30=\"\",\"\",'BİLGİ GİRİŞİ'!E30)","v":"AIO (All In One) Masaüstü Bilgisayar "},null,null,null,null,null,null,null,null,null,null,null,null,null,null,null,null,null,null,null,null,null,{"$f":"IF('BİLGİ GİRİŞİ'!W30=\"\",\"\",'BİLGİ GİRİŞİ'!W30)","v":"Adet"},null,null,null,{"$f":"IF('BİLGİ GİRİŞİ'!T30=\"\",\"\",'BİLGİ GİRİŞİ'!T30)","v":20}]
[{"$f":"IF('BİLGİ GİRİŞİ'!D31=\"\",\"\",'BİLGİ GİRİŞİ'!D31)","v":2},{"$f":"IF('BİLGİ GİRİŞİ'!E31=\"\",\"\",'BİLGİ GİRİŞİ'!E31)","v":"Fotokopi Makinesi"},null,null,null,null,null,null,null,null,null,null,null,null,null,null,null,null,null,null,null,null,null,{"$f":"IF('BİLGİ GİRİŞİ'!W31=\"\",\"\",'BİLGİ GİRİŞİ'!W31)","v":"Adet"},null,null,null,{"$f":"IF('BİLGİ GİRİŞİ'!T31=\"\",\"\",'BİLGİ GİRİŞİ'!T31)","v":10}]
[{"$f":"IF('BİLGİ GİRİŞİ'!D32=\"\",\"\",'BİLGİ GİRİŞİ'!D32)","v":3},{"$f":"IF('BİLGİ GİRİŞİ'!E32=\"\",\"\",'BİLGİ GİRİŞİ'!E32)","v":"Projektör"},null,null,null,null,null,null,null,null,null,null,null,null,null,null,null,null,null,null,null,null,null,{"$f":"IF('BİLGİ GİRİŞİ'!W32=\"\",\"\",'BİLGİ GİRİŞİ'!W32)","v":"Adet"},null,null,null,{"$f":"IF('BİLGİ GİRİŞİ'!T32=\"\",\"\",'BİLGİ GİRİŞİ'!T32)","v":4}]
[{"$f":"IF('BİLGİ GİRİŞİ'!D33=\"\",\"\",'BİLGİ GİRİŞİ'!D33)","v":""},{"$f":"IF('BİLGİ GİRİŞİ'!E33=\"\",\"\",'BİLGİ GİRİŞİ'!E33)","v":""},null,null,null,null,null,null,null,null,null,null,null,null,null,null,null,null,null,null,null,null,null,{"$f":"IF('BİLGİ GİRİŞİ'!W33=\"\",\"\",'BİLGİ GİRİŞİ'!W33)","v":""},null,null,null,{"$f":"IF('BİLGİ GİRİŞİ'!T33=\"\",\"\",'BİLGİ GİRİŞİ'!T33)","v":""}]
[{"$f":"IF('BİLGİ GİRİŞİ'!D34=\"\",\"\",'BİLGİ GİRİŞİ'!D34)","v":""},{"$f":"IF('BİLGİ GİRİŞİ'!E34=\"\",\"\",'BİLGİ GİRİŞİ'!E34)","v":""},null,null,null,null,null,null,null,null,null,null,null,null,null,null,null,null,null,null,null,null,null,{"$f":"IF('BİLGİ GİRİŞİ'!W34=\"\",\"\",'BİLGİ GİRİŞİ'!W34)","v":""},null,null,null,{"$f":"IF('BİLGİ GİRİŞİ'!T34=\"\",\"\",'BİLGİ GİRİŞİ'!T34)","v":""}]
[{"$f":"IF('BİLGİ GİRİŞİ'!D35=\"\",\"\",'BİLGİ GİRİŞİ'!D35)","v":""},{"$f":"IF('BİLGİ GİRİŞİ'!E35=\"\",\"\",'BİLGİ GİRİŞİ'!E35)","v":""},null,null,null,null,null,null,null,null,null,null,null,null,null,null,null,null,null,null,null,null,null,{"$f":"IF('BİLGİ GİRİŞİ'!W35=\"\",\"\",'BİLGİ GİRİŞİ'!W35)","v":""},null,null,null,{"$f":"IF('BİLGİ GİRİŞİ'!T35=\"\",\"\",'BİLGİ GİRİŞİ'!T35)","v":""}]
[{"$f":"IF('BİLGİ GİRİŞİ'!D36=\"\",\"\",'BİLGİ GİRİŞİ'!D36)","v":""},{"$f":"IF('BİLGİ GİRİŞİ'!E36=\"\",\"\",'BİLGİ GİRİŞİ'!E36)","v":""},null,null,null,null,null,null,null,null,null,null,null,null,null,null,null,null,null,null,null,null,null,{"$f":"IF('BİLGİ GİRİŞİ'!W36=\"\",\"\",'BİLGİ GİRİŞİ'!W36)","v":""},null,null,null,{"$f":"IF('BİLGİ GİRİŞİ'!T36=\"\",\"\",'BİLGİ GİRİŞİ'!T36)","v":""}]
[{"$f":"IF('BİLGİ GİRİŞİ'!D37=\"\",\"\",'BİLGİ GİRİŞİ'!D37)","v":""},{"$f":"IF('BİLGİ GİRİŞİ'!E37=\"\",\"\",'BİLGİ GİRİŞİ'!E37)","v":""},null,null,null,null,null,null,null,null,null,null,null,null,null,null,null,null,null,null,null,null,null,{"$f":"IF('BİLGİ GİRİŞİ'!W37=\"\",\"\",'BİLGİ GİRİŞİ'!W37)","v":""},null,null,null,{"$f":"IF('BİLGİ GİRİŞİ'!T37=\"\",\"\",'BİLGİ GİRİŞİ'!T37)","v":""}]
[{"$f":"IF('BİLGİ GİRİŞİ'!D38=\"\",\"\",'BİLGİ GİRİŞİ'!D38)","v":""},{"$f":"IF('BİLGİ GİRİŞİ'!E38=\"\",\"\",'BİLGİ GİRİŞİ'!E38)","v":""},null,null,null,null,null,null,null,null,null,null,null,null,null,null,null,null,null,null,null,null,null,{"$f":"IF('BİLGİ GİRİŞİ'!W38=\"\",\"\",'BİLGİ GİRİŞİ'!W38)","v":""},null,null,null,{"$f":"IF('BİLGİ GİRİŞİ'!T38=\"\",\"\",'BİLGİ GİRİŞİ'!T38)","v":""}]
[{"$f":"IF('BİLGİ GİRİŞİ'!D39=\"\",\"\",'BİLGİ GİRİŞİ'!D39)","v":""},{"$f":"IF('BİLGİ GİRİŞİ'!E39=\"\",\"\",'BİLGİ GİRİŞİ'!E39)","v":""},null,null,null,null,null,null,null,null,null,null,null,null,null,null,null,null,null,null,null,null,null,{"$f":"IF('BİLGİ GİRİŞİ'!W39=\"\",\"\",'BİLGİ GİRİŞİ'!W39)","v":""},null,null,null,{"$f":"IF('BİLGİ GİRİŞİ'!T39=\"\",\"\",'BİLGİ GİRİŞİ'!T39)","v":""}]
[{"$f":"IF('BİLGİ GİRİŞİ'!D40=\"\",\"\",'BİLGİ GİRİŞİ'!D40)","v":""},{"$f":"IF('BİLGİ GİRİŞİ'!E40=\"\",\"\",'BİLGİ GİRİŞİ'!E40)","v":""},null,null,null,null,null,null,null,null,null,null,null,null,null,null,null,null,null,null,null,null,null,{"$f":"IF('BİLGİ GİRİŞİ'!W40=\"\",\"\",'BİLGİ GİRİŞİ'!W40)","v":""},null,null,null,{"$f":"IF('BİLGİ GİRİŞİ'!T40=\"\",\"\",'BİLGİ GİRİŞİ'!T40)","v":""}]
[{"$f":"IF('BİLGİ GİRİŞİ'!D41=\"\",\"\",'BİLGİ GİRİŞİ'!D41)","v":""},{"$f":"IF('BİLGİ GİRİŞİ'!E41=\"\",\"\",'BİLGİ GİRİŞİ'!E41)","v":""},null,null,null,null,null,null,null,null,null,null,null,null,null,null,null,null,null,null,null,null,null,{"$f":"IF('BİLGİ GİRİŞİ'!W41=\"\",\"\",'BİLGİ GİRİŞİ'!W41)","v":""},null,null,null,{"$f":"IF('BİLGİ GİRİŞİ'!T41=\"\",\"\",'BİLGİ GİRİŞİ'!T41)","v":""}]
[{"$f":"IF('BİLGİ GİRİŞİ'!D42=\"\",\"\",'BİLGİ GİRİŞİ'!D42)","v":""},{"$f":"IF('BİLGİ GİRİŞİ'!E42=\"\",\"\",'BİLGİ GİRİŞİ'!E42)","v":""},null,null,null,null,null,null,null,null,null,null,null,null,null,null,null,null,null,null,null,null,null,{"$f":"IF('BİLGİ GİRİŞİ'!W42=\"\",\"\",'BİLGİ GİRİŞİ'!W42)","v":""},null,null,null,{"$f":"IF('BİLGİ GİRİŞİ'!T42=\"\",\"\",'BİLGİ GİRİŞİ'!T42)","v":""}]
[{"$f":"IF('BİLGİ GİRİŞİ'!D43=\"\",\"\",'BİLGİ GİRİŞİ'!D43)","v":""},{"$f":"IF('BİLGİ GİRİŞİ'!E43=\"\",\"\",'BİLGİ GİRİŞİ'!E43)","v":""},null,null,null,null,null,null,null,null,null,null,null,null,null,null,null,null,null,null,null,null,null,{"$f":"IF('BİLGİ GİRİŞİ'!W43=\"\",\"\",'BİLGİ GİRİŞİ'!W43)","v":""},null,null,null,{"$f":"IF('BİLGİ GİRİŞİ'!T43=\"\",\"\",'BİLGİ GİRİŞİ'!T43)","v":""}]
[{"$f":"IF('BİLGİ GİRİŞİ'!D44=\"\",\"\",'BİLGİ GİRİŞİ'!D44)","v":""},{"$f":"IF('BİLGİ GİRİŞİ'!E44=\"\",\"\",'BİLGİ GİRİŞİ'!E44)","v":""},null,null,null,null,null,null,null,null,null,null,null,null,null,null,null,null,null,null,null,null,null,{"$f":"IF('BİLGİ GİRİŞİ'!W44=\"\",\"\",'BİLGİ GİRİŞİ'!W44)","v":""},null,null,null,{"$f":"IF('BİLGİ GİRİŞİ'!T44=\"\",\"\",'BİLGİ GİRİŞİ'!T44)","v":""}]
[{"$f":"IF('BİLGİ GİRİŞİ'!D45=\"\",\"\",'BİLGİ GİRİŞİ'!D45)","v":""},{"$f":"IF('BİLGİ GİRİŞİ'!E45=\"\",\"\",'BİLGİ GİRİŞİ'!E45)","v":""},null,null,null,null,null,null,null,null,null,null,null,null,null,null,null,null,null,null,null,null,null,{"$f":"IF('BİLGİ GİRİŞİ'!W45=\"\",\"\",'BİLGİ GİRİŞİ'!W45)","v":""},null,null,null,{"$f":"IF('BİLGİ GİRİŞİ'!T45=\"\",\"\",'BİLGİ GİRİŞİ'!T45)","v":""}]
[{"$f":"IF('BİLGİ GİRİŞİ'!D46=\"\",\"\",'BİLGİ GİRİŞİ'!D46)","v":""},{"$f":"IF('BİLGİ GİRİŞİ'!E46=\"\",\"\",'BİLGİ GİRİŞİ'!E46)","v":""},null,null,null,null,null,null,null,null,null,null,null,null,null,null,null,null,null,null,null,null,null,{"$f":"IF('BİLGİ GİRİŞİ'!W46=\"\",\"\",'BİLGİ GİRİŞİ'!W46)","v":""},null,null,null,{"$f":"IF('BİLGİ GİRİŞİ'!T46=\"\",\"\",'BİLGİ GİRİŞİ'!T46)","v":""}]
[{"$f":"IF('BİLGİ GİRİŞİ'!D47=\"\",\"\",'BİLGİ GİRİŞİ'!D47)","v":""},{"$f":"IF('BİLGİ GİRİŞİ'!E47=\"\",\"\",'BİLGİ GİRİŞİ'!E47)","v":""},null,null,null,null,null,null,null,null,null,null,null,null,null,null,null,null,null,null,null,null,null,{"$f":"IF('BİLGİ GİRİŞİ'!W47=\"\",\"\",'BİLGİ GİRİŞİ'!W47)","v":""},null,null,null,{"$f":"IF('BİLGİ GİRİŞİ'!T47=\"\",\"\",'BİLGİ GİRİŞİ'!T47)","v":""}]
[{"$f":"IF('BİLGİ GİRİŞİ'!D48=\"\",\"\",'BİLGİ GİRİŞİ'!D48)","v":""},{"$f":"IF('BİLGİ GİRİŞİ'!E48=\"\",\"\",'BİLGİ GİRİŞİ'!E48)","v":""},null,null,null,null,null,null,null,null,null,null,null,null,null,null,null,null,null,null,null,null,null,{"$f":"IF('BİLGİ GİRİŞİ'!W48=\"\",\"\",'BİLGİ GİRİŞİ'!W48)","v":""},null,null,null,{"$f":"IF('BİLGİ GİRİŞİ'!T48=\"\",\"\",'BİLGİ GİRİŞİ'!T48)","v":""}]
[{"$f":"IF('BİLGİ GİRİŞİ'!D49=\"\",\"\",'BİLGİ GİRİŞİ'!D49)","v":""},{"$f":"IF('BİLGİ GİRİŞİ'!E49=\"\",\"\",'BİLGİ GİRİŞİ'!E49)","v":""},null,null,null,null,null,null,null,null,null,null,null,null,null,null,null,null,null,null,null,null,null,{"$f":"IF('BİLGİ GİRİŞİ'!W49=\"\",\"\",'BİLGİ GİRİŞİ'!W49)","v":""},null,null,null,{"$f":"IF('BİLGİ GİRİŞİ'!T49=\"\",\"\",'BİLGİ GİRİŞİ'!T49)","v":""}]
[]
["PİYASA ARAŞTIRMA GÖREVLİLERİ"]
[{"$f":"IF('BİLGİ GİRİŞİ'!AB17=\"\",\"\",'BİLGİ GİRİŞİ'!AB17)","v":"Ahmet DEMİR"},null,null,null,null,null,null,null,null,null,{"$f":"IF('BİLGİ GİRİŞİ'!AH17=\"\",\"\",'BİLGİ GİRİŞİ'!AH17)","v":"Ayşe YILDIZ"},null,null,null,null,null,null,null,null,null,null,{"$f":"IF('BİLGİ GİRİŞİ'!AN17=\"\",\"\",'BİLGİ GİRİŞİ'!AN17)","v":""}]
[{"$f":"IF(A50=\"\",\"\",'BİLGİ GİRİŞİ'!AB18)","v":"Müdür Yardımcısı 1"},null,null,null,null,null,null,null,null,null,{"$f":"IF(K50=\"\",\"\",'BİLGİ GİRİŞİ'!AH18)","v":"Öğretmen 1"},null,null,null,null,null,null,null,null,null,null,{"$f":"IF(V50=\"\",\"\",'BİLGİ GİRİŞİ'!AN18)","v":""}]
[]
["MUAYENE VE KABUL GÖREVLİLERİ"]
[{"$f":"IF('BİLGİ GİRİŞİ'!AB22=\"\",\"\",'BİLGİ GİRİŞİ'!AB22)","v":"Mehmet  ÇELİK"},null,null,null,null,null,null,null,null,null,{"$f":"IF('BİLGİ GİRİŞİ'!AH22=\"\",\"\",'BİLGİ GİRİŞİ'!AH22)","v":"Fatma GÜNEŞ"},null,null,null,null,null,null,null,null,null,null,{"$f":"IF('BİLGİ GİRİŞİ'!AN22=\"\",\"\",'BİLGİ GİRİŞİ'!AN22)","v":""}]
[{"$f":"IF(A54=\"\",\"\",'BİLGİ GİRİŞİ'!AB23)","v":"Müdür Yardımcısı 2"},null,null,null,null,null,null,null,null,null,{"$f":"IF(K54=\"\",\"\",'BİLGİ GİRİŞİ'!AH23)","v":"Öğretmen 2"},null,null,null,null,null,null,null,null,null,null,{"$f":"IF(V54=\"\",\"\",'BİLGİ GİRİŞİ'!AN23)","v":""}]

{"sheet":"2","index":3,"n_rows":53,"n_cols":28,"rows_kept":53,"cut":false,"hidden":false,"merged":[[1,0,1,30],[2,0,2,30],[3,0,3,30],[5,0,5,2],[5,4,5,21],[5,25,5,30],[22,0,22,30],[24,0,26,30],[28,0,28,30],[18,10,18,19],[19,10,19,19],[18,0,18,9],[19,0,19,9],[17,0,17,9],[29,1,29,14],[29,15,29,18],[29,19,29,22],[29,23,29,26],[29,27,29,30],[6,0,6,2],[6,4,6,26],[8,0,8,30],[18,20,18,30],[19,20,19,30],[17,10,17,19],[17,20,17,30],[30,1,30,14],[30,19,30,22],[30,15,30,18],[30,23,30,26],[30,27,30,30],[31,1,31,14],[31,19,31,22],[31,15,31,18],[31,23,31,26],[31,27,31,30],[32,1,32,14],[32,19,32,22],[32,15,32,18],[32,23,32,26],[32,27,32,30],[33,1,33,14],[33,15,33,18],[33,19,33,22],[33,23,33,26],[33,27,33,30],[34,1,34,14],[34,15,34,18],[34,19,34,22],[34,23,34,26],[34,27,34,30],[35,1,35,14],[35,15,35,18],[35,19,35,22],[35,23,35,26],[35,27,35,30],[36,1,36,14],[36,15,36,18],[36,19,36,22],[36,23,36,26],[36,27,36,30],[37,1,37,14],[37,15,37,18],[37,19,37,22],[37,23,37,26],[37,27,37,30],[38,1,38,14],[38,15,38,18],[38,19,38,22],[38,23,38,26],[38,27,38,30],[39,1,39,14],[39,15,39,18],[39,19,39,22],[39,23,39,26],[39,27,39,30],[40,1,40,14],[40,15,40,18],[40,19,40,22],[40,23,40,26],[40,27,40,30],[41,1,41,14],[41,15,41,18],[41,19,41,22],[41,23,41,26],[41,27,41,30],[42,1,42,14],[42,15,42,18],[42,19,42,22],[42,23,42,26],[42,27,42,30],[43,1,43,14],[43,15,43,18],[43,19,43,22],[43,23,43,26],[43,27,43,30],[47,23,47,26],[47,27,47,30],[44,1,44,14],[44,15,44,18],[44,19,44,22],[44,23,44,26],[44,27,44,30],[45,1,45,14],[45,15,45,18],[45,19,45,22],[45,23,45,26],[45,27,45,30],[50,0,50,22],[50,23,50,26],[50,27,50,30],[52,20,52,30],[10,0,11,30],[12,0,14,30],[48,1,48,14],[48,15,48,18],[48,19,48,22],[48,23,48,26],[48,27,48,30],[49,1,49,14],[49,15,49,18],[49,19,49,22],[49,23,49,26],[49,27,49,30],[46,1,46,14],[46,15,46,18],[46,19,46,22],[46,23,46,26],[46,27,46,30],[47,1,47,14],[47,15,47,18],[47,19,47,22]]}
[]
["T.C."]
[{"$f":"IF('BİLGİ GİRİŞİ'!O7=\"\",\"\",'BİLGİ GİRİŞİ'!O7)","v":"BULANIK KAYMAKAMLIĞI"}]
[{"$f":"IF('BİLGİ GİRİŞİ'!O8=\"\",\"\",'BİLGİ GİRİŞİ'!O8)","v":"Atatürk İlkokulu Müdürlüğü"}]
[]
["Sayı",null,null,":",{"$f":"IF('BİLGİ GİRİŞİ'!S15=\"\",\"\",'BİLGİ GİRİŞİ'!S15)","v":456789123},null,null,null,null,null,null,null,null,null,null,null,null,null,null,null,null,null,null,null,null,{"$f":"IF('BİLGİ GİRİŞİ'!O16=\"\",\"…../…../……..\",'BİLGİ GİRİŞİ'!O16)","v":"2023-03-06"}]
["Konu",null,null,":","Yaklaşık Maliyet Araştırması"]
[]
["İLGİLİ GERÇEK/TÜZEL KİŞİLERE"]
[]
[{"$f":"CONCATENATE(\"       \",\"Kurumumuz ihtiyaçlarında kullanılmak üzere aşağıda bilgileri verilen  Mal/Hizmet/Yapım İşi,  Kamu İhale Kanunu'nun \",IF('BİLGİ GİRİŞİ'!O10=\"\",\".............................................................................\",'BİLGİ GİRİŞİ'!O10),\" maddesine göre Doğrudan Temin yoluyla satın alınacaktır.\")","v":"       Kurumumuz ihtiyaçlarında kullanılmak üzere aşağıda bilgileri verilen  Mal/Hizmet/Yapım İşi,  Kamu İhale Kanunu'nun 22/d maddesine göre Doğrudan Temin yoluyla satın alınacaktır."}]
[]
["          Yaklaşık maliyetin tespitinde değerlendirilmek üzere aşağıda bilgileri verilen Mal'ın/Hizmet'in/Yapım İşi'nin KDV hariç piyasa fiyatlarının karşılarına yazılması ve Kurumumuza gönderilmesi hususunda;\n        Gereğini rica ederim/ederiz"]
[]
[]
[]
[]
[{"$f":"IF(A19=\"\",\"\",IF('BİLGİ GİRİŞİ'!AH16=\"\",\"\",'BİLGİ GİRİŞİ'!AH16))","v":"Piyasa Araştırma Görevlisi"},null,null,null,null,null,null,null,null,null,{"$f":"IF(K19=\"\",\"\",IF('BİLGİ GİRİŞİ'!AN16=\"\",\"\",'BİLGİ GİRİŞİ'!AN16))","v":""},null,null,null,null,null,null,null,null,null,{"$f":"IF(U19=\"\",\"\",IF('BİLGİ GİRİŞİ'!AB16=\"\",\"\",'BİLGİ GİRİŞİ'!AB16))","v":"Piyasa Araştırma Görevlisi"}]
[{"$f":"IF('BİLGİ GİRİŞİ'!AH17=\"\",\"\",'BİLGİ GİRİŞİ'!AH17)","v":"Ayşe YILDIZ"},null,null,null,null,null,null,null,null,null,{"$f":"IF('BİLGİ GİRİŞİ'!AN17=\"\",\"\",'BİLGİ GİRİŞİ'!AN17)","v":""},null,null,null,null,null,null,null,null,null,{"$f":"IF('BİLGİ GİRİŞİ'!AB17=\"\",\"\",'BİLGİ GİRİŞİ'!AB17)","v":"Ahmet DEMİR"}]
[{"$f":"IF(A19=\"\",\"\",IF('BİLGİ GİRİŞİ'!AH18=\"\",\"\",'BİLGİ GİRİŞİ'!AH18))","v":"Öğretmen 1"},null,null,null,null,null,null,null,null,null,{"$f":"IF(K19=\"\",\"\",IF('BİLGİ GİRİŞİ'!AN18=\"\",\"\",'BİLGİ GİRİŞİ'!AN18))","v":""},null,null,null,null,null,null,null,null,null,{"$f":"IF(U19=\"\",\"\",IF('BİLGİ GİRİŞİ'!AB18=\"\",\"\",'BİLGİ GİRİŞİ'!AB18))","v":"Müdür Yardımcısı 1"}]
[]
[]
[{"$f":"IF('BİLGİ GİRİŞİ'!O8=\"\",\"\",CONCATENATE(UPPER('BİLGİ GİRİŞİ'!O8),\"\",UPPER(IF('BİLGİ GİRİŞİ'!O8=\"\",\"\",'BİLGİ GİRİŞİ'!AN8))))","v":"ATATÜRK İLKOKULU MÜDÜRLÜĞÜNE"}]
[]
["          Kurumunuzca satın alınacak  Mal'ın/Hizmet'in/Yapım İşi'nin piyasa fiyatları aşağıya çıkarılmıştır.\n          Gereğini bilgilerinize arz ederim/ederiz."]
[]
[]
[]
["MAL'IN/HİZMET'İN/YAPIM İŞİ'NİN"]
["S","Kalem/KısımBilgileri",null,null,null,null,null,null,null,null,null,null,null,null,null,"Birimi",null,null,null,"Miktarı",null,null,null,"Birim Fiyatı",null,null,null,"Toplam Fiyatı"]
[{"$f":"IF('BİLGİ GİRİŞİ'!D30=\"\",\"\",'BİLGİ GİRİŞİ'!D30)","v":1},{"$f":"IF('BİLGİ GİRİŞİ'!E30=\"\",\"\",'BİLGİ GİRİŞİ'!E30)","v":"AIO (All In One) Masaüstü Bilgisayar "},null,null,null,null,null,null,null,null,null,null,null,null,null,{"$f":"IF('BİLGİ GİRİŞİ'!W30=\"\",\"\",'BİLGİ GİRİŞİ'!W30)","v":"Adet"},null,null,null,{"$f":"IF('BİLGİ GİRİŞİ'!T30=\"\",\"\",IF('BİLGİ GİRİŞİ'!$BN$28=1,\"1\",'BİLGİ GİRİŞİ'!T30))","v":"1"}]
[{"$f":"IF('BİLGİ GİRİŞİ'!D31=\"\",\"\",'BİLGİ GİRİŞİ'!D31)","v":2},{"$f":"IF('BİLGİ GİRİŞİ'!E31=\"\",\"\",'BİLGİ GİRİŞİ'!E31)","v":"Fotokopi Makinesi"},null,null,null,null,null,null,null,null,null,null,null,null,null,{"$f":"IF('BİLGİ GİRİŞİ'!W31=\"\",\"\",'BİLGİ GİRİŞİ'!W31)","v":"Adet"},null,null,null,{"$f":"IF('BİLGİ GİRİŞİ'!T31=\"\",\"\",IF('BİLGİ GİRİŞİ'!$BN$28=1,\"1\",'BİLGİ GİRİŞİ'!T31))","v":"1"}]
[{"$f":"IF('BİLGİ GİRİŞİ'!D32=\"\",\"\",'BİLGİ GİRİŞİ'!D32)","v":3},{"$f":"IF('BİLGİ GİRİŞİ'!E32=\"\",\"\",'BİLGİ GİRİŞİ'!E32)","v":"Projektör"},null,null,null,null,null,null,null,null,null,null,null,null,null,{"$f":"IF('BİLGİ GİRİŞİ'!W32=\"\",\"\",'BİLGİ GİRİŞİ'!W32)","v":"Adet"},null,null,null,{"$f":"IF('BİLGİ GİRİŞİ'!T32=\"\",\"\",IF('BİLGİ GİRİŞİ'!$BN$28=1,\"1\",'BİLGİ GİRİŞİ'!T32))","v":"1"}]
[{"$f":"IF('BİLGİ GİRİŞİ'!D33=\"\",\"\",'BİLGİ GİRİŞİ'!D33)","v":""},{"$f":"IF('BİLGİ GİRİŞİ'!E33=\"\",\"\",'BİLGİ GİRİŞİ'!E33)","v":""},null,null,null,null,null,null,null,null,null,null,null,null,null,{"$f":"IF('BİLGİ GİRİŞİ'!W33=\"\",\"\",'BİLGİ GİRİŞİ'!W33)","v":""},null,null,null,{"$f":"IF('BİLGİ GİRİŞİ'!T33=\"\",\"\",IF('BİLGİ GİRİŞİ'!$BN$28=1,\"1\",'BİLGİ GİRİŞİ'!T33))","v":""}]
[{"$f":"IF('BİLGİ GİRİŞİ'!D34=\"\",\"\",'BİLGİ GİRİŞİ'!D34)","v":""},{"$f":"IF('BİLGİ GİRİŞİ'!E34=\"\",\"\",'BİLGİ GİRİŞİ'!E34)","v":""},null,null,null,null,null,null,null,null,null,null,null,null,null,{"$f":"IF('BİLGİ GİRİŞİ'!W34=\"\",\"\",'BİLGİ GİRİŞİ'!W34)","v":""},null,null,null,{"$f":"IF('BİLGİ GİRİŞİ'!T34=\"\",\"\",IF('BİLGİ GİRİŞİ'!$BN$28=1,\"1\",'BİLGİ GİRİŞİ'!T34))","v":""}]
[{"$f":"IF('BİLGİ GİRİŞİ'!D35=\"\",\"\",'BİLGİ GİRİŞİ'!D35)","v":""},{"$f":"IF('BİLGİ GİRİŞİ'!E35=\"\",\"\",'BİLGİ GİRİŞİ'!E35)","v":""},null,null,null,null,null,null,null,null,null,null,null,null,null,{"$f":"IF('BİLGİ GİRİŞİ'!W35=\"\",\"\",'BİLGİ GİRİŞİ'!W35)","v":""},null,null,null,{"$f":"IF('BİLGİ GİRİŞİ'!T35=\"\",\"\",IF('BİLGİ GİRİŞİ'!$BN$28=1,\"1\",'BİLGİ GİRİŞİ'!T35))","v":""}]
[{"$f":"IF('BİLGİ GİRİŞİ'!D36=\"\",\"\",'BİLGİ GİRİŞİ'!D36)","v":""},{"$f":"IF('BİLGİ GİRİŞİ'!E36=\"\",\"\",'BİLGİ GİRİŞİ'!E36)","v":""},null,null,null,null,null,null,null,null,null,null,null,null,null,{"$f":"IF('BİLGİ GİRİŞİ'!W36=\"\",\"\",'BİLGİ GİRİŞİ'!W36)","v":""},null,null,null,{"$f":"IF('BİLGİ GİRİŞİ'!T36=\"\",\"\",IF('BİLGİ GİRİŞİ'!$BN$28=1,\"1\",'BİLGİ GİRİŞİ'!T36))","v":""}]
[{"$f":"IF('BİLGİ GİRİŞİ'!D37=\"\",\"\",'BİLGİ GİRİŞİ'!D37)","v":""},{"$f":"IF('BİLGİ GİRİŞİ'!E37=\"\",\"\",'BİLGİ GİRİŞİ'!E37)","v":""},null,null,null,null,null,null,null,null,null,null,null,null,null,{"$f":"IF('BİLGİ GİRİŞİ'!W37=\"\",\"\",'BİLGİ GİRİŞİ'!W37)","v":""},null,null,null,{"$f":"IF('BİLGİ GİRİŞİ'!T37=\"\",\"\",IF('BİLGİ GİRİŞİ'!$BN$28=1,\"1\",'BİLGİ GİRİŞİ'!T37))","v":""}]
[{"$f":"IF('BİLGİ GİRİŞİ'!D38=\"\",\"\",'BİLGİ GİRİŞİ'!D38)","v":""},{"$f":"IF('BİLGİ GİRİŞİ'!E38=\"\",\"\",'BİLGİ GİRİŞİ'!E38)","v":""},null,null,null,null,null,null,null,null,null,null,null,null,null,{"$f":"IF('BİLGİ GİRİŞİ'!W38=\"\",\"\",'BİLGİ GİRİŞİ'!W38)","v":""},null,null,null,{"$f":"IF('BİLGİ GİRİŞİ'!T38=\"\",\"\",IF('BİLGİ GİRİŞİ'!$BN$28=1,\"1\",'BİLGİ GİRİŞİ'!T38))","v":""}]
[{"$f":"IF('BİLGİ GİRİŞİ'!D39=\"\",\"\",'BİLGİ GİRİŞİ'!D39)","v":""},{"$f":"IF('BİLGİ GİRİŞİ'!E39=\"\",\"\",'BİLGİ GİRİŞİ'!E39)","v":""},null,null,null,null,null,null,null,null,null,null,null,null,null,{"$f":"IF('BİLGİ GİRİŞİ'!W39=\"\",\"\",'BİLGİ GİRİŞİ'!W39)","v":""},null,null,null,{"$f":"IF('BİLGİ GİRİŞİ'!T39=\"\",\"\",IF('BİLGİ GİRİŞİ'!$BN$28=1,\"1\",'BİLGİ GİRİŞİ'!T39))","v":""}]
[{"$f":"IF('BİLGİ GİRİŞİ'!D40=\"\",\"\",'BİLGİ GİRİŞİ'!D40)","v":""},{"$f":"IF('BİLGİ GİRİŞİ'!E40=\"\",\"\",'BİLGİ GİRİŞİ'!E40)","v":""},null,null,null,null,null,null,null,null,null,null,null,null,null,{"$f":"IF('BİLGİ GİRİŞİ'!W40=\"\",\"\",'BİLGİ GİRİŞİ'!W40)","v":""},null,null,null,{"$f":"IF('BİLGİ GİRİŞİ'!T40=\"\",\"\",IF('BİLGİ GİRİŞİ'!$BN$28=1,\"1\",'BİLGİ GİRİŞİ'!T40))","v":""}]
[{"$f":"IF('BİLGİ GİRİŞİ'!D41=\"\",\"\",'BİLGİ GİRİŞİ'!D41)","v":""},{"$f":"IF('BİLGİ GİRİŞİ'!E41=\"\",\"\",'BİLGİ GİRİŞİ'!E41)","v":""},null,null,null,null,null,null,null,null,null,null,null,null,null,{"$f":"IF('BİLGİ GİRİŞİ'!W41=\"\",\"\",'BİLGİ GİRİŞİ'!W41)","v":""},null,null,null,{"$f":"IF('BİLGİ GİRİŞİ'!T41=\"\",\"\",IF('BİLGİ GİRİŞİ'!$BN$28=1,\"1\",'BİLGİ GİRİŞİ'!T41))","v":""}]
[{"$f":"IF('BİLGİ GİRİŞİ'!D42=\"\",\"\",'BİLGİ GİRİŞİ'!D42)","v":""},{"$f":"IF('BİLGİ GİRİŞİ'!E42=\"\",\"\",'BİLGİ GİRİŞİ'!E42)","v":""},null,null,null,null,null,null,null,null,null,null,null,null,null,{"$f":"IF('BİLGİ GİRİŞİ'!W42=\"\",\"\",'BİLGİ GİRİŞİ'!W42)","v":""},null,null,null,{"$f":"IF('BİLGİ GİRİŞİ'!T42=\"\",\"\",IF('BİLGİ GİRİŞİ'!$BN$28=1,\"1\",'BİLGİ GİRİŞİ'!T42))","v":""}]
[{"$f":"IF('BİLGİ GİRİŞİ'!D43=\"\",\"\",'BİLGİ GİRİŞİ'!D43)","v":""},{"$f":"IF('BİLGİ GİRİŞİ'!E43=\"\",\"\",'BİLGİ GİRİŞİ'!E43)","v":""},null,null,null,null,null,null,null,null,null,null,null,null,null,{"$f":"IF('BİLGİ GİRİŞİ'!W43=\"\",\"\",'BİLGİ GİRİŞİ'!W43)","v":""},null,null,null,{"$f":"IF('BİLGİ GİRİŞİ'!T43=\"\",\"\",IF('BİLGİ GİRİŞİ'!$BN$28=1,\"1\",'BİLGİ GİRİŞİ'!T43))","v":""}]
[{"$f":"IF('BİLGİ GİRİŞİ'!D44=\"\",\"\",'BİLGİ GİRİŞİ'!D44)","v":""},{"$f":"IF('BİLGİ GİRİŞİ'!E44=\"\",\"\",'BİLGİ GİRİŞİ'!E44)","v":""},null,null,null,null,null,null,null,null,null,null,null,null,null,{"$f":"IF('BİLGİ GİRİŞİ'!W44=\"\",\"\",'BİLGİ GİRİŞİ'!W44)","v":""},null,null,null,{"$f":"IF('BİLGİ GİRİŞİ'!T44=\"\",\"\",IF('BİLGİ GİRİŞİ'!$BN$28=1,\"1\",'BİLGİ GİRİŞİ'!T44))","v":""}]
[{"$f":"IF('BİLGİ GİRİŞİ'!D45=\"\",\"\",'BİLGİ GİRİŞİ'!D45)","v":""},{"$f":"IF('BİLGİ GİRİŞİ'!E45=\"\",\"\",'BİLGİ GİRİŞİ'!E45)","v":""},null,null,null,null,null,null,null,null,null,null,null,null,null,{"$f":"IF('BİLGİ GİRİŞİ'!W45=\"\",\"\",'BİLGİ GİRİŞİ'!W45)","v":""},null,null,null,{"$f":"IF('BİLGİ GİRİŞİ'!T45=\"\",\"\",IF('BİLGİ GİRİŞİ'!$BN$28=1,\"1\",'BİLGİ GİRİŞİ'!T45))","v":""}]
[{"$f":"IF('BİLGİ GİRİŞİ'!D46=\"\",\"\",'BİLGİ GİRİŞİ'!D46)","v":""},{"$f":"IF('BİLGİ GİRİŞİ'!E46=\"\",\"\",'BİLGİ GİRİŞİ'!E46)","v":""},null,null,null,null,null,null,null,null,null,null,null,null,null,{"$f":"IF('BİLGİ GİRİŞİ'!W46=\"\",\"\",'BİLGİ GİRİŞİ'!W46)","v":""},null,null,null,{"$f":"IF('BİLGİ GİRİŞİ'!T46=\"\",\"\",IF('BİLGİ GİRİŞİ'!$BN$28=1,\"1\",'BİLGİ GİRİŞİ'!T46))","v":""}]
[{"$f":"IF('BİLGİ GİRİŞİ'!D47=\"\",\"\",'BİLGİ GİRİŞİ'!D47)","v":""},{"$f":"IF('BİLGİ GİRİŞİ'!E47=\"\",\"\",'BİLGİ GİRİŞİ'!E47)","v":""},null,null,null,null,null,null,null,null,null,null,null,null,null,{"$f":"IF('BİLGİ GİRİŞİ'!W47=\"\",\"\",'BİLGİ GİRİŞİ'!W47)","v":""},null,null,null,{"$f":"IF('BİLGİ GİRİŞİ'!T47=\"\",\"\",IF('BİLGİ GİRİŞİ'!$BN$28=1,\"1\",'BİLGİ GİRİŞİ'!T47))","v":""}]
[{"$f":"IF('BİLGİ GİRİŞİ'!D48=\"\",\"\",'BİLGİ GİRİŞİ'!D48)","v":""},{"$f":"IF('BİLGİ GİRİŞİ'!E48=\"\",\"\",'BİLGİ GİRİŞİ'!E48)","v":""},null,null,null,null,null,null,null,null,null,null,null,null,null,{"$f":"IF('BİLGİ GİRİŞİ'!W48=\"\",\"\",'BİLGİ GİRİŞİ'!W48)","v":""},null,null,null,{"$f":"IF('BİLGİ GİRİŞİ'!T48=\"\",\"\",IF('BİLGİ GİRİŞİ'!$BN$28=1,\"1\",'BİLGİ GİRİŞİ'!T48))","v":""}]
[{"$f":"IF('BİLGİ GİRİŞİ'!D49=\"\",\"\",'BİLGİ GİRİŞİ'!D49)","v":""},{"$f":"IF('BİLGİ GİRİŞİ'!E49=\"\",\"\",'BİLGİ GİRİŞİ'!E49)","v":""},null,null,null,null,null,null,null,null,null,null,null,null,null,{"$f":"IF('BİLGİ GİRİŞİ'!W49=\"\",\"\",'BİLGİ GİRİŞİ'!W49)","v":""},null,null,null,{"$f":"IF('BİLGİ GİRİŞİ'!T49=\"\",\"\",IF('BİLGİ GİRİŞİ'!$BN$28=1,\"1\",'BİLGİ GİRİŞİ'!T49))","v":""}]
["TOPLAM (KDV Hariç)"]
[]
[null,null,null,null,null,null,null,null,null,null,null,null,null,null,null,null,null,null,null,null,"KİŞİ/FİRMA KAŞE/İMZA"]

{"sheet":"3","index":4,"n_rows":45,"n_cols":45,"rows_kept":45,"cut":false,"hidden":false,"merged":[[1,0,1,46],[3,0,3,9],[3,11,3,41],[3,42,3,46],[5,0,5,9],[5,11,5,46],[6,0,6,9],[6,11,6,14],[6,16,6,46],[4,0,4,9],[4,11,4,46],[8,0,10,46],[12,0,12,22],[12,23,12,40],[12,41,13,46],[13,0,14,0],[13,1,14,14],[13,15,14,18],[14,41,14,43],[14,44,14,46],[13,19,14,22],[13,23,13,28],[13,29,13,34],[13,35,13,40],[14,23,14,25],[14,26,14,28],[14,29,14,31],[14,32,14,34],[14,35,14,37],[14,38,14,40],[15,41,15,43],[15,44,15,46],[16,1,16,14],[16,19,16,22],[16,15,16,18],[16,23,16,25],[16,26,16,28],[16,29,16,31],[16,32,16,34],[15,1,15,14],[15,19,15,22],[15,15,15,18],[15,23,15,25],[15,26,15,28],[15,29,15,31],[15,32,15,34],[15,35,15,37],[15,38,15,40],[18,1,18,14],[18,15,18,18],[18,19,18,22],[18,23,18,25],[18,26,18,28],[16,35,16,37],[16,38,16,40],[16,41,16,43],[16,44,16,46],[17,1,17,14],[17,19,17,22],[17,15,17,18],[17,23,17,25],[17,26,17,28],[17,29,17,31],[18,29,18,31],[18,32,18,34],[18,35,18,37],[18,38,18,40],[18,41,18,43],[18,44,18,46],[17,32,17,34],[17,35,17,37],[17,38,17,40],[17,41,17,43],[17,44,17,46],[20,1,20,14],[20,15,20,18],[20,19,20,22],[20,23,20,25],[20,26,20,28],[19,1,19,14],[19,15,19,18],[19,19,19,22],[19,23,19,25],[19,26,19,28],[20,29,20,31],[20,32,20,34],[20,35,20,37],[20,38,20,40],[20,41,20,43],[20,44,20,46],[19,32,19,34],[19,35,19,37],[19,38,19,40],[19,41,19,43],[19,44,19,46],[19,29,19,31],[22,1,22,14],[22,15,22,18],[22,19,22,22],[22,23,22,25],[22,26,22,28],[21,1,21,14],[21,15,21,18],[21,19,21,22],[21,23,21,25],[21,26,21,28],[22,29,22,31],[22,32,22,34],[22,35,22,37],[22,38,22,40],[22,41,22,43],[22,44,22,46],[21,32,21,34],[21,35,21,37],[21,38,21,40],[21,41,21,43],[21,44,21,46],[21,29,21,31],[24,1,24,14],[24,15,24,18],[24,19,24,22],[24,23,24,25],[24,26,24,28],[23,1,23,14],[23,15,23,18],[23,19,23,22],[23,23,23,25],[23,26,23,28],[24,29,24,31],[24,32,24,34],[24,35,24,37],[24,38,24,40],[24,41,24,43],[24,44,24,46],[23,32,23,34],[23,35,23,37],[23,38,23,40],[23,41,23,43],[23,44,23,46],[23,29,23,31],[26,1,26,14],[26,15,26,18],[26,19,26,22],[26,23,26,25],[26,26,26,28],[25,1,25,14],[25,15,25,18],[25,19,25,22],[25,23,25,25],[25,26,25,28],[26,29,26,31],[26,32,26,34],[26,35,26,37],[26,38,26,40],[26,41,26,43],[26,44,26,46],[25,32,25,34],[25,35,25,37],[25,38,25,40],[25,41,25,43],[25,44,25,46],[25,29,25,31],[28,1,28,14],[28,15,28,18],[28,19,28,22],[28,23,28,25],[28,26,28,28],[27,1,27,14],[27,15,27,18],[27,19,27,22],[27,23,27,25],[27,26,27,28],[28,29,28,31],[28,32,28,34],[28,35,28,37],[28,38,28,40],[28,41,28,43],[28,44,28,46],[27,32,27,34],[27,35,27,37],[27,38,27,40],[27,41,27,43],[27,44,27,46],[27,29,27,31],[30,1,30,14],[30,15,30,18],[30,19,30,22],[30,23,30,25],[30,26,30,28],[29,1,29,14],[29,15,29,18],[29,19,29,22],[29,23,29,25],[29,26,29,28],[30,29,30,31],[30,32,30,34],[30,35,30,37],[30,38,30,40],[30,41,30,43],[30,44,30,46],[29,32,29,34],[29,35,29,37],[29,38,29,40],[29,41,29,43],[29,44,29,46],[29,29,29,31],[32,1,32,14],[32,15,32,18],[32,19,32,22],[32,23,32,25],[32,26,32,28],[31,1,31,14],[31,15,31,18],[31,19,31,22],[31,23,31,25],[31,26,31,28],[32,29,32,31],[32,32,32,34],[32,35,32,37],[32,38,32,40],[32,41,32,43],[32,44,32,46],[31,32,31,34],[31,35,31,37],[31,38,31,40],[31,41,31,43],[31,44,31,46],[31,29,31,31],[33,32,33,34],[33,35,33,37],[33,38,33,40],[33,41,33,43],[33,44,33,46],[34,1,34,14],[34,15,34,18],[34,19,34,22],[34,23,34,25],[34,26,34,28],[33,1,33,14],[33,15,33,18],[33,19,33,22],[33,23,33,25],[33,26,33,28],[33,29,33,31],[35,44,35,46],[37,0,37,17],[37,18,37,23],[37,24,37,46],[40,1,40,11],[34,29,34,31],[34,32,34,34],[34,35,34,37],[34,38,34,40],[34,41,34,43],[34,44,34,46],[40,12,40,22],[35,0,35,22],[35,23,35,25],[35,26,35,28],[35,29,35,31],[35,32,35,34],[35,35,35,37],[35,38,35,40],[35,41,35,43],[44,34,44,46],[43,34,43,46],[41,34,41,46],[40,34,40,46],[40,23,40,33],[43,12,43,22],[43,23,43,33],[44,1,44,11],[44,12,44,22],[44,23,44,33],[43,1,43,11]]}
[]
["YAKLAŞIK MALİYET HESAP CETVELİ"]
[]
["İdarenin Adı",null,null,null,null,null,null,null,null,null,":",{"$f":"IF('BİLGİ GİRİŞİ'!O8=\"\",\"\",'BİLGİ GİRİŞİ'!O8)","v":"Atatürk İlkokulu Müdürlüğü"},null,null,null,null,null,null,null,null,null,null,null,null,null,null,null,null,null,null,null,null,null,null,null,null,null,null,null,null,null,null,{"$f":"IF('BİLGİ GİRİŞİ'!O17=\"\",\"….../….../….…..\",'BİLGİ GİRİŞİ'!O17)","v":"2023-03-07"}]
["Doğrudan Temin Numarası",null,null,null,null,null,null,null,null,null,":",{"$f":"IF('BİLGİ GİRİŞİ'!O11=\"\",\"\",'BİLGİ GİRİŞİ'!O11)","v":"22DT1211930"}]
["Mal/Hizmet/Yapım Adı, Niteliği ",null,null,null,null,null,null,null,null,null,":",{"$f":"IF('BİLGİ GİRİŞİ'!O9=\"\",\"\",'BİLGİ GİRİŞİ'!O9)","v":"Bilişim Malzemeleri Alımı"}]
["Alım/Görevlendirme Onay Tarihi/sayısı",null,null,null,null,null,null,null,null,null,":",{"$f":"IF('BİLGİ GİRİŞİ'!O15=\"\",\"\",'BİLGİ GİRİŞİ'!O15)","v":"2023-03-06"},null,null,null,"/",{"$f":"IF('BİLGİ GİRİŞİ'!S15=\"\",\"\",'BİLGİ GİRİŞİ'!S15)","v":456789123}]
[]
[{"$f":"CONCATENATE(\"       \",\"Kurumumuz ihtiyaçlarında kullanılmak üzere aşağıda bilgileri verilen  Mal/Hizmet/Yapım İşi,  Kamu İhale Kanunu'nun \",IF('BİLGİ GİRİŞİ'!O10=\"\",\".............................................................................\",'BİLGİ GİRİŞİ'!O10),\" maddesine göre Doğrudan Temin yoluyla satın alınmak üzere piyasa fiyat araştırması yapılmış olup verilen fiyatlar ve yaklaşık maliyet aşağıya çıkarılmıştır.\")","v":"       Kurumumuz ihtiyaçlarında kullanılmak üzere aşağıda bilgileri verilen  Mal/Hizmet/Yapım İşi,  Kamu İhale Kanunu'nun 22/d maddesine göre Doğrudan Temin yoluyla satın alınmak üzere piyasa fiyat araştırması yapılmış olup verilen fiyatlar ve yaklaşık maliyet aşağıya çıkarılmıştır."}]
[]
[]
[]
["MAL'IN/HİZMET'İN/YAPIM İŞİ'NİN",null,null,null,null,null,null,null,null,null,null,null,null,null,null,null,null,null,null,null,null,null,null,"TEKLİF VEREN KİŞİLER/FİRMALAR VE TEKLİF FİYATLARI ",null,null,null,null,null,null,null,null,null,null,null,null,null,null,null,null,null,"YAKLAŞIK MALİYET"]
["S","Kalem/KısımBilgileri",null,null,null,null,null,null,null,null,null,null,null,null,null,"Birimi",null,null,null,"Miktarı",null,null,null,{"$f":"IF('BİLGİ GİRİŞİ'!AB28=\"\",\"\",'BİLGİ GİRİŞİ'!AB28)","v":"A GERÇEK/TÜZEL KİŞİSİ"},null,null,null,null,null,{"$f":"IF('BİLGİ GİRİŞİ'!AJ28=\"\",\"\",'BİLGİ GİRİŞİ'!AJ28)","v":"B GERÇEK/TÜZEL KİŞİSİ"},null,null,null,null,null,{"$f":"IF('BİLGİ GİRİŞİ'!AR28=\"\",\"\",'BİLGİ GİRİŞİ'!AR28)","v":"C GERÇEK/TÜZEL KİŞİSİ"}]
[null,null,null,null,null,null,null,null,null,null,null,null,null,null,null,null,null,null,null,null,null,null,null,"Birim Fiyat",null,null,"Toplam Fiyat",null,null,"Birim Fiyat",null,null,"Toplam Fiyat",null,null,"Birim Fiyat",null,null,"Toplam Fiyat",null,null,"Birim Fiyat",null,null,"Toplam Fiyat"]
[{"$f":"IF('BİLGİ GİRİŞİ'!D30=\"\",\"\",'BİLGİ GİRİŞİ'!D30)","v":1},{"$f":"IF('BİLGİ GİRİŞİ'!E30=\"\",\"\",'BİLGİ GİRİŞİ'!E30)","v":"AIO (All In One) Masaüstü Bilgisayar "},null,null,null,null,null,null,null,null,null,null,null,null,null,{"$f":"IF('BİLGİ GİRİŞİ'!W30=\"\",\"\",'BİLGİ GİRİŞİ'!W30)","v":"Adet"},null,null,null,{"$f":"IF('BİLGİ GİRİŞİ'!T30=\"\",\"\",'BİLGİ GİRİŞİ'!T30)","v":20},null,null,null,{"$f":"IF('BİLGİ GİRİŞİ'!AB30=\"\",\"\",'BİLGİ GİRİŞİ'!AB30)","v":14000},null,null,{"$f":"IF('BİLGİ GİRİŞİ'!AF30=\"\",\"\",'BİLGİ GİRİŞİ'!AF30)","v":280000},null,null,{"$f":"IF('BİLGİ GİRİŞİ'!AJ30=\"\",\"\",'BİLGİ GİRİŞİ'!AJ30)","v":12000},null,null,{"$f":"IF('BİLGİ GİRİŞİ'!AN30=\"\",\"\",'BİLGİ GİRİŞİ'!AN30)","v":240000},null,null,{"$f":"IF('BİLGİ GİRİŞİ'!AR30=\"\",\"\",'BİLGİ GİRİŞİ'!AR30)","v":13000},null,null,{"$f":"IF('BİLGİ GİRİŞİ'!AV30=\"\",\"\",'BİLGİ GİRİŞİ'!AV30)","v":260000},null,null,{"$f":"IF(P16=\"\",\"\",(X16+AD16+AJ16)/3)","v":13000},null,null,{"$f":"IF(P16=\"\",\"\",(AA16+AG16+AM16)/3)","v":260000}]
[{"$f":"IF('BİLGİ GİRİŞİ'!D31=\"\",\"\",'BİLGİ GİRİŞİ'!D31)","v":2},{"$f":"IF('BİLGİ GİRİŞİ'!E31=\"\",\"\",'BİLGİ GİRİŞİ'!E31)","v":"Fotokopi Makinesi"},null,null,null,null,null,null,null,null,null,null,null,null,null,{"$f":"IF('BİLGİ GİRİŞİ'!W31=\"\",\"\",'BİLGİ GİRİŞİ'!W31)","v":"Adet"},null,null,null,{"$f":"IF('BİLGİ GİRİŞİ'!T31=\"\",\"\",'BİLGİ GİRİŞİ'!T31)","v":10},null,null,null,{"$f":"IF('BİLGİ GİRİŞİ'!AB31=\"\",\"\",'BİLGİ GİRİŞİ'!AB31)","v":11000},null,null,{"$f":"IF('BİLGİ GİRİŞİ'!AF31=\"\",\"\",'BİLGİ GİRİŞİ'!AF31)","v":110000},null,null,{"$f":"IF('BİLGİ GİRİŞİ'!AJ31=\"\",\"\",'BİLGİ GİRİŞİ'!AJ31)","v":9000},null,null,{"$f":"IF('BİLGİ GİRİŞİ'!AN31=\"\",\"\",'BİLGİ GİRİŞİ'!AN31)","v":90000},null,null,{"$f":"IF('BİLGİ GİRİŞİ'!AR31=\"\",\"\",'BİLGİ GİRİŞİ'!AR31)","v":10000},null,null,{"$f":"IF('BİLGİ GİRİŞİ'!AV31=\"\",\"\",'BİLGİ GİRİŞİ'!AV31)","v":100000},null,null,{"$f":"IF(P17=\"\",\"\",(X17+AD17+AJ17)/3)","v":10000},null,null,{"$f":"IF(P17=\"\",\"\",(AA17+AG17+AM17)/3)","v":100000}]
[{"$f":"IF('BİLGİ GİRİŞİ'!D32=\"\",\"\",'BİLGİ GİRİŞİ'!D32)","v":3},{"$f":"IF('BİLGİ GİRİŞİ'!E32=\"\",\"\",'BİLGİ GİRİŞİ'!E32)","v":"Projektör"},null,null,null,null,null,null,null,null,null,null,null,null,null,{"$f":"IF('BİLGİ GİRİŞİ'!W32=\"\",\"\",'BİLGİ GİRİŞİ'!W32)","v":"Adet"},null,null,null,{"$f":"IF('BİLGİ GİRİŞİ'!T32=\"\",\"\",'BİLGİ GİRİŞİ'!T32)","v":4},null,null,null,{"$f":"IF('BİLGİ GİRİŞİ'!AB32=\"\",\"\",'BİLGİ GİRİŞİ'!AB32)","v":8000},null,null,{"$f":"IF('BİLGİ GİRİŞİ'!AF32=\"\",\"\",'BİLGİ GİRİŞİ'!AF32)","v":32000},null,null,{"$f":"IF('BİLGİ GİRİŞİ'!AJ32=\"\",\"\",'BİLGİ GİRİŞİ'!AJ32)","v":6000},null,null,{"$f":"IF('BİLGİ GİRİŞİ'!AN32=\"\",\"\",'BİLGİ GİRİŞİ'!AN32)","v":24000},null,null,{"$f":"IF('BİLGİ GİRİŞİ'!AR32=\"\",\"\",'BİLGİ GİRİŞİ'!AR32)","v":7000},null,null,{"$f":"IF('BİLGİ GİRİŞİ'!AV32=\"\",\"\",'BİLGİ GİRİŞİ'!AV32)","v":28000},null,null,{"$f":"IF(P18=\"\",\"\",(X18+AD18+AJ18)/3)","v":7000},null,null,28000]
[{"$f":"IF('BİLGİ GİRİŞİ'!D33=\"\",\"\",'BİLGİ GİRİŞİ'!D33)","v":""},{"$f":"IF('BİLGİ GİRİŞİ'!E33=\"\",\"\",'BİLGİ GİRİŞİ'!E33)","v":""},null,null,null,null,null,null,null,null,null,null,null,null,null,{"$f":"IF('BİLGİ GİRİŞİ'!W33=\"\",\"\",'BİLGİ GİRİŞİ'!W33)","v":""},null,null,null,{"$f":"IF('BİLGİ GİRİŞİ'!T33=\"\",\"\",'BİLGİ GİRİŞİ'!T33)","v":""},null,null,null,{"$f":"IF('BİLGİ GİRİŞİ'!AB33=\"\",\"\",'BİLGİ GİRİŞİ'!AB33)","v":""},null,null,{"$f":"IF('BİLGİ GİRİŞİ'!AF33=\"\",\"\",'BİLGİ GİRİŞİ'!AF33)","v":""},null,null,{"$f":"IF('BİLGİ GİRİŞİ'!AJ33=\"\",\"\",'BİLGİ GİRİŞİ'!AJ33)","v":""},null,null,{"$f":"IF('BİLGİ GİRİŞİ'!AN33=\"\",\"\",'BİLGİ GİRİŞİ'!AN33)","v":""},null,null,{"$f":"IF('BİLGİ GİRİŞİ'!AR33=\"\",\"\",'BİLGİ GİRİŞİ'!AR33)","v":""},null,null,{"$f":"IF('BİLGİ GİRİŞİ'!AV33=\"\",\"\",'BİLGİ GİRİŞİ'!AV33)","v":""},null,null,"",null,null,""]
[{"$f":"IF('BİLGİ GİRİŞİ'!D34=\"\",\"\",'BİLGİ GİRİŞİ'!D34)","v":""},{"$f":"IF('BİLGİ GİRİŞİ'!E34=\"\",\"\",'BİLGİ GİRİŞİ'!E34)","v":""},null,null,null,null,null,null,null,null,null,null,null,null,null,{"$f":"IF('BİLGİ GİRİŞİ'!W34=\"\",\"\",'BİLGİ GİRİŞİ'!W34)","v":""},null,null,null,{"$f":"IF('BİLGİ GİRİŞİ'!T34=\"\",\"\",'BİLGİ GİRİŞİ'!T34)","v":""},null,null,null,{"$f":"IF('BİLGİ GİRİŞİ'!AB34=\"\",\"\",'BİLGİ GİRİŞİ'!AB34)","v":""},null,null,{"$f":"IF('BİLGİ GİRİŞİ'!AF34=\"\",\"\",'BİLGİ GİRİŞİ'!AF34)","v":""},null,null,{"$f":"IF('BİLGİ GİRİŞİ'!AJ34=\"\",\"\",'BİLGİ GİRİŞİ'!AJ34)","v":""},null,null,{"$f":"IF('BİLGİ GİRİŞİ'!AN34=\"\",\"\",'BİLGİ GİRİŞİ'!AN34)","v":""},null,null,{"$f":"IF('BİLGİ GİRİŞİ'!AR34=\"\",\"\",'BİLGİ GİRİŞİ'!AR34)","v":""},null,null,{"$f":"IF('BİLGİ GİRİŞİ'!AV34=\"\",\"\",'BİLGİ GİRİŞİ'!AV34)","v":""},null,null,"",null,null,""]
[{"$f":"IF('BİLGİ GİRİŞİ'!D35=\"\",\"\",'BİLGİ GİRİŞİ'!D35)","v":""},{"$f":"IF('BİLGİ GİRİŞİ'!E35=\"\",\"\",'BİLGİ GİRİŞİ'!E35)","v":""},null,null,null,null,null,null,null,null,null,null,null,null,null,{"$f":"IF('BİLGİ GİRİŞİ'!W35=\"\",\"\",'BİLGİ GİRİŞİ'!W35)","v":""},null,null,null,{"$f":"IF('BİLGİ GİRİŞİ'!T35=\"\",\"\",'BİLGİ GİRİŞİ'!T35)","v":""},null,null,null,{"$f":"IF('BİLGİ GİRİŞİ'!AB35=\"\",\"\",'BİLGİ GİRİŞİ'!AB35)","v":""},null,null,{"$f":"IF('BİLGİ GİRİŞİ'!AF35=\"\",\"\",'BİLGİ GİRİŞİ'!AF35)","v":""},null,null,{"$f":"IF('BİLGİ GİRİŞİ'!AJ35=\"\",\"\",'BİLGİ GİRİŞİ'!AJ35)","v":""},null,null,{"$f":"IF('BİLGİ GİRİŞİ'!AN35=\"\",\"\",'BİLGİ GİRİŞİ'!AN35)","v":""},null,null,{"$f":"IF('BİLGİ GİRİŞİ'!AR35=\"\",\"\",'BİLGİ GİRİŞİ'!AR35)","v":""},null,null,{"$f":"IF('BİLGİ GİRİŞİ'!AV35=\"\",\"\",'BİLGİ GİRİŞİ'!AV35)","v":""},null,null,"",null,null,""]
[{"$f":"IF('BİLGİ GİRİŞİ'!D36=\"\",\"\",'BİLGİ GİRİŞİ'!D36)","v":""},{"$f":"IF('BİLGİ GİRİŞİ'!E36=\"\",\"\",'BİLGİ GİRİŞİ'!E36)","v":""},null,null,null,null,null,null,null,null,null,null,null,null,null,{"$f":"IF('BİLGİ GİRİŞİ'!W36=\"\",\"\",'BİLGİ GİRİŞİ'!W36)","v":""},null,null,null,{"$f":"IF('BİLGİ GİRİŞİ'!T36=\"\",\"\",'BİLGİ GİRİŞİ'!T36)","v":""},null,null,null,{"$f":"IF('BİLGİ GİRİŞİ'!AB36=\"\",\"\",'BİLGİ GİRİŞİ'!AB36)","v":""},null,null,{"$f":"IF('BİLGİ GİRİŞİ'!AF36=\"\",\"\",'BİLGİ GİRİŞİ'!AF36)","v":""},null,null,{"$f":"IF('BİLGİ GİRİŞİ'!AJ36=\"\",\"\",'BİLGİ GİRİŞİ'!AJ36)","v":""},null,null,{"$f":"IF('BİLGİ GİRİŞİ'!AN36=\"\",\"\",'BİLGİ GİRİŞİ'!AN36)","v":""},null,null,{"$f":"IF('BİLGİ GİRİŞİ'!AR36=\"\",\"\",'BİLGİ GİRİŞİ'!AR36)","v":""},null,null,{"$f":"IF('BİLGİ GİRİŞİ'!AV36=\"\",\"\",'BİLGİ GİRİŞİ'!AV36)","v":""},null,null,"",null,null,""]
[{"$f":"IF('BİLGİ GİRİŞİ'!D37=\"\",\"\",'BİLGİ GİRİŞİ'!D37)","v":""},{"$f":"IF('BİLGİ GİRİŞİ'!E37=\"\",\"\",'BİLGİ GİRİŞİ'!E37)","v":""},null,null,null,null,null,null,null,null,null,null,null,null,null,{"$f":"IF('BİLGİ GİRİŞİ'!W37=\"\",\"\",'BİLGİ GİRİŞİ'!W37)","v":""},null,null,null,{"$f":"IF('BİLGİ GİRİŞİ'!T37=\"\",\"\",'BİLGİ GİRİŞİ'!T37)","v":""},null,null,null,{"$f":"IF('BİLGİ GİRİŞİ'!AB37=\"\",\"\",'BİLGİ GİRİŞİ'!AB37)","v":""},null,null,{"$f":"IF('BİLGİ GİRİŞİ'!AF37=\"\",\"\",'BİLGİ GİRİŞİ'!AF37)","v":""},null,null,{"$f":"IF('BİLGİ GİRİŞİ'!AJ37=\"\",\"\",'BİLGİ GİRİŞİ'!AJ37)","v":""},null,null,{"$f":"IF('BİLGİ GİRİŞİ'!AN37=\"\",\"\",'BİLGİ GİRİŞİ'!AN37)","v":""},null,null,{"$f":"IF('BİLGİ GİRİŞİ'!AR37=\"\",\"\",'BİLGİ GİRİŞİ'!AR37)","v":""},null,null,{"$f":"IF('BİLGİ GİRİŞİ'!AV37=\"\",\"\",'BİLGİ GİRİŞİ'!AV37)","v":""},null,null,"",null,null,""]
[{"$f":"IF('BİLGİ GİRİŞİ'!D38=\"\",\"\",'BİLGİ GİRİŞİ'!D38)","v":""},{"$f":"IF('BİLGİ GİRİŞİ'!E38=\"\",\"\",'BİLGİ GİRİŞİ'!E38)","v":""},null,null,null,null,null,null,null,null,null,null,null,null,null,{"$f":"IF('BİLGİ GİRİŞİ'!W38=\"\",\"\",'BİLGİ GİRİŞİ'!W38)","v":""},null,null,null,{"$f":"IF('BİLGİ GİRİŞİ'!T38=\"\",\"\",'BİLGİ GİRİŞİ'!T38)","v":""},null,null,null,{"$f":"IF('BİLGİ GİRİŞİ'!AB38=\"\",\"\",'BİLGİ GİRİŞİ'!AB38)","v":""},null,null,{"$f":"IF('BİLGİ GİRİŞİ'!AF38=\"\",\"\",'BİLGİ GİRİŞİ'!AF38)","v":""},null,null,{"$f":"IF('BİLGİ GİRİŞİ'!AJ38=\"\",\"\",'BİLGİ GİRİŞİ'!AJ38)","v":""},null,null,{"$f":"IF('BİLGİ GİRİŞİ'!AN38=\"\",\"\",'BİLGİ GİRİŞİ'!AN38)","v":""},null,null,{"$f":"IF('BİLGİ GİRİŞİ'!AR38=\"\",\"\",'BİLGİ GİRİŞİ'!AR38)","v":""},null,null,{"$f":"IF('BİLGİ GİRİŞİ'!AV38=\"\",\"\",'BİLGİ GİRİŞİ'!AV38)","v":""},null,null,"",null,null,""]
[{"$f":"IF('BİLGİ GİRİŞİ'!D39=\"\",\"\",'BİLGİ GİRİŞİ'!D39)","v":""},{"$f":"IF('BİLGİ GİRİŞİ'!E39=\"\",\"\",'BİLGİ GİRİŞİ'!E39)","v":""},null,null,null,null,null,null,null,null,null,null,null,null,null,{"$f":"IF('BİLGİ GİRİŞİ'!W39=\"\",\"\",'BİLGİ GİRİŞİ'!W39)","v":""},null,null,null,{"$f":"IF('BİLGİ GİRİŞİ'!T39=\"\",\"\",'BİLGİ GİRİŞİ'!T39)","v":""},null,null,null,{"$f":"IF('BİLGİ GİRİŞİ'!AB39=\"\",\"\",'BİLGİ GİRİŞİ'!AB39)","v":""},null,null,{"$f":"IF('BİLGİ GİRİŞİ'!AF39=\"\",\"\",'BİLGİ GİRİŞİ'!AF39)","v":""},null,null,{"$f":"IF('BİLGİ GİRİŞİ'!AJ39=\"\",\"\",'BİLGİ GİRİŞİ'!AJ39)","v":""},null,null,{"$f":"IF('BİLGİ GİRİŞİ'!AN39=\"\",\"\",'BİLGİ GİRİŞİ'!AN39)","v":""},null,null,{"$f":"IF('BİLGİ GİRİŞİ'!AR39=\"\",\"\",'BİLGİ GİRİŞİ'!AR39)","v":""},null,null,{"$f":"IF('BİLGİ GİRİŞİ'!AV39=\"\",\"\",'BİLGİ GİRİŞİ'!AV39)","v":""},null,null,"",null,null,""]
[{"$f":"IF('BİLGİ GİRİŞİ'!D40=\"\",\"\",'BİLGİ GİRİŞİ'!D40)","v":""},{"$f":"IF('BİLGİ GİRİŞİ'!E40=\"\",\"\",'BİLGİ GİRİŞİ'!E40)","v":""},null,null,null,null,null,null,null,null,null,null,null,null,null,{"$f":"IF('BİLGİ GİRİŞİ'!W40=\"\",\"\",'BİLGİ GİRİŞİ'!W40)","v":""},null,null,null,{"$f":"IF('BİLGİ GİRİŞİ'!T40=\"\",\"\",'BİLGİ GİRİŞİ'!T40)","v":""},null,null,null,{"$f":"IF('BİLGİ GİRİŞİ'!AB40=\"\",\"\",'BİLGİ GİRİŞİ'!AB40)","v":""},null,null,{"$f":"IF('BİLGİ GİRİŞİ'!AF40=\"\",\"\",'BİLGİ GİRİŞİ'!AF40)","v":""},null,null,{"$f":"IF('BİLGİ GİRİŞİ'!AJ40=\"\",\"\",'BİLGİ GİRİŞİ'!AJ40)","v":""},null,null,{"$f":"IF('BİLGİ GİRİŞİ'!AN40=\"\",\"\",'BİLGİ GİRİŞİ'!AN40)","v":""},null,null,{"$f":"IF('BİLGİ GİRİŞİ'!AR40=\"\",\"\",'BİLGİ GİRİŞİ'!AR40)","v":""},null,null,{"$f":"IF('BİLGİ GİRİŞİ'!AV40=\"\",\"\",'BİLGİ GİRİŞİ'!AV40)","v":""},null,null,"",null,null,""]
[{"$f":"IF('BİLGİ GİRİŞİ'!D41=\"\",\"\",'BİLGİ GİRİŞİ'!D41)","v":""},{"$f":"IF('BİLGİ GİRİŞİ'!E41=\"\",\"\",'BİLGİ GİRİŞİ'!E41)","v":""},null,null,null,null,null,null,null,null,null,null,null,null,null,{"$f":"IF('BİLGİ GİRİŞİ'!W41=\"\",\"\",'BİLGİ GİRİŞİ'!W41)","v":""},null,null,null,{"$f":"IF('BİLGİ GİRİŞİ'!T41=\"\",\"\",'BİLGİ GİRİŞİ'!T41)","v":""},null,null,null,{"$f":"IF('BİLGİ GİRİŞİ'!AB41=\"\",\"\",'BİLGİ GİRİŞİ'!AB41)","v":""},null,null,{"$f":"IF('BİLGİ GİRİŞİ'!AF41=\"\",\"\",'BİLGİ GİRİŞİ'!AF41)","v":""},null,null,{"$f":"IF('BİLGİ GİRİŞİ'!AJ41=\"\",\"\",'BİLGİ GİRİŞİ'!AJ41)","v":""},null,null,{"$f":"IF('BİLGİ GİRİŞİ'!AN41=\"\",\"\",'BİLGİ GİRİŞİ'!AN41)","v":""},null,null,{"$f":"IF('BİLGİ GİRİŞİ'!AR41=\"\",\"\",'BİLGİ GİRİŞİ'!AR41)","v":""},null,null,{"$f":"IF('BİLGİ GİRİŞİ'!AV41=\"\",\"\",'BİLGİ GİRİŞİ'!AV41)","v":""},null,null,"",null,null,""]
[{"$f":"IF('BİLGİ GİRİŞİ'!D42=\"\",\"\",'BİLGİ GİRİŞİ'!D42)","v":""},{"$f":"IF('BİLGİ GİRİŞİ'!E42=\"\",\"\",'BİLGİ GİRİŞİ'!E42)","v":""},null,null,null,null,null,null,null,null,null,null,null,null,null,{"$f":"IF('BİLGİ GİRİŞİ'!W42=\"\",\"\",'BİLGİ GİRİŞİ'!W42)","v":""},null,null,null,{"$f":"IF('BİLGİ GİRİŞİ'!T42=\"\",\"\",'BİLGİ GİRİŞİ'!T42)","v":""},null,null,null,{"$f":"IF('BİLGİ GİRİŞİ'!AB42=\"\",\"\",'BİLGİ GİRİŞİ'!AB42)","v":""},null,null,{"$f":"IF('BİLGİ GİRİŞİ'!AF42=\"\",\"\",'BİLGİ GİRİŞİ'!AF42)","v":""},null,null,{"$f":"IF('BİLGİ GİRİŞİ'!AJ42=\"\",\"\",'BİLGİ GİRİŞİ'!AJ42)","v":""},null,null,{"$f":"IF('BİLGİ GİRİŞİ'!AN42=\"\",\"\",'BİLGİ GİRİŞİ'!AN42)","v":""},null,null,{"$f":"IF('BİLGİ GİRİŞİ'!AR42=\"\",\"\",'BİLGİ GİRİŞİ'!AR42)","v":""},null,null,{"$f":"IF('BİLGİ GİRİŞİ'!AV42=\"\",\"\",'BİLGİ GİRİŞİ'!AV42)","v":""},null,null,"",null,null,""]
[{"$f":"IF('BİLGİ GİRİŞİ'!D43=\"\",\"\",'BİLGİ GİRİŞİ'!D43)","v":""},{"$f":"IF('BİLGİ GİRİŞİ'!E43=\"\",\"\",'BİLGİ GİRİŞİ'!E43)","v":""},null,null,null,null,null,null,null,null,null,null,null,null,null,{"$f":"IF('BİLGİ GİRİŞİ'!W43=\"\",\"\",'BİLGİ GİRİŞİ'!W43)","v":""},null,null,null,{"$f":"IF('BİLGİ GİRİŞİ'!T43=\"\",\"\",'BİLGİ GİRİŞİ'!T43)","v":""},null,null,null,{"$f":"IF('BİLGİ GİRİŞİ'!AB43=\"\",\"\",'BİLGİ GİRİŞİ'!AB43)","v":""},null,null,{"$f":"IF('BİLGİ GİRİŞİ'!AF43=\"\",\"\",'BİLGİ GİRİŞİ'!AF43)","v":""},null,null,{"$f":"IF('BİLGİ GİRİŞİ'!AJ43=\"\",\"\",'BİLGİ GİRİŞİ'!AJ43)","v":""},null,null,{"$f":"IF('BİLGİ GİRİŞİ'!AN43=\"\",\"\",'BİLGİ GİRİŞİ'!AN43)","v":""},null,null,{"$f":"IF('BİLGİ GİRİŞİ'!AR43=\"\",\"\",'BİLGİ GİRİŞİ'!AR43)","v":""},null,null,{"$f":"IF('BİLGİ GİRİŞİ'!AV43=\"\",\"\",'BİLGİ GİRİŞİ'!AV43)","v":""},null,null,"",null,null,""]
[{"$f":"IF('BİLGİ GİRİŞİ'!D44=\"\",\"\",'BİLGİ GİRİŞİ'!D44)","v":""},{"$f":"IF('BİLGİ GİRİŞİ'!E44=\"\",\"\",'BİLGİ GİRİŞİ'!E44)","v":""},null,null,null,null,null,null,null,null,null,null,null,null,null,{"$f":"IF('BİLGİ GİRİŞİ'!W44=\"\",\"\",'BİLGİ GİRİŞİ'!W44)","v":""},null,null,null,{"$f":"IF('BİLGİ GİRİŞİ'!T44=\"\",\"\",'BİLGİ GİRİŞİ'!T44)","v":""},null,null,null,{"$f":"IF('BİLGİ GİRİŞİ'!AB44=\"\",\"\",'BİLGİ GİRİŞİ'!AB44)","v":""},null,null,{"$f":"IF('BİLGİ GİRİŞİ'!AF44=\"\",\"\",'BİLGİ GİRİŞİ'!AF44)","v":""},null,null,{"$f":"IF('BİLGİ GİRİŞİ'!AJ44=\"\",\"\",'BİLGİ GİRİŞİ'!AJ44)","v":""},null,null,{"$f":"IF('BİLGİ GİRİŞİ'!AN44=\"\",\"\",'BİLGİ GİRİŞİ'!AN44)","v":""},null,null,{"$f":"IF('BİLGİ GİRİŞİ'!AR44=\"\",\"\",'BİLGİ GİRİŞİ'!AR44)","v":""},null,null,{"$f":"IF('BİLGİ GİRİŞİ'!AV44=\"\",\"\",'BİLGİ GİRİŞİ'!AV44)","v":""},null,null,"",null,null,""]
[{"$f":"IF('BİLGİ GİRİŞİ'!D45=\"\",\"\",'BİLGİ GİRİŞİ'!D45)","v":""},{"$f":"IF('BİLGİ GİRİŞİ'!E45=\"\",\"\",'BİLGİ GİRİŞİ'!E45)","v":""},null,null,null,null,null,null,null,null,null,null,null,null,null,{"$f":"IF('BİLGİ GİRİŞİ'!W45=\"\",\"\",'BİLGİ GİRİŞİ'!W45)","v":""},null,null,null,{"$f":"IF('BİLGİ GİRİŞİ'!T45=\"\",\"\",'BİLGİ GİRİŞİ'!T45)","v":""},null,null,null,{"$f":"IF('BİLGİ GİRİŞİ'!AB45=\"\",\"\",'BİLGİ GİRİŞİ'!AB45)","v":""},null,null,{"$f":"IF('BİLGİ GİRİŞİ'!AF45=\"\",\"\",'BİLGİ GİRİŞİ'!AF45)","v":""},null,null,{"$f":"IF('BİLGİ GİRİŞİ'!AJ45=\"\",\"\",'BİLGİ GİRİŞİ'!AJ45)","v":""},null,null,{"$f":"IF('BİLGİ GİRİŞİ'!AN45=\"\",\"\",'BİLGİ GİRİŞİ'!AN45)","v":""},null,null,{"$f":"IF('BİLGİ GİRİŞİ'!AR45=\"\",\"\",'BİLGİ GİRİŞİ'!AR45)","v":""},null,null,{"$f":"IF('BİLGİ GİRİŞİ'!AV45=\"\",\"\",'BİLGİ GİRİŞİ'!AV45)","v":""},null,null,"",null,null,""]
[{"$f":"IF('BİLGİ GİRİŞİ'!D46=\"\",\"\",'BİLGİ GİRİŞİ'!D46)","v":""},{"$f":"IF('BİLGİ GİRİŞİ'!E46=\"\",\"\",'BİLGİ GİRİŞİ'!E46)","v":""},null,null,null,null,null,null,null,null,null,null,null,null,null,{"$f":"IF('BİLGİ GİRİŞİ'!W46=\"\",\"\",'BİLGİ GİRİŞİ'!W46)","v":""},null,null,null,{"$f":"IF('BİLGİ GİRİŞİ'!T46=\"\",\"\",'BİLGİ GİRİŞİ'!T46)","v":""},null,null,null,{"$f":"IF('BİLGİ GİRİŞİ'!AB46=\"\",\"\",'BİLGİ GİRİŞİ'!AB46)","v":""},null,null,{"$f":"IF('BİLGİ GİRİŞİ'!AF46=\"\",\"\",'BİLGİ GİRİŞİ'!AF46)","v":""},null,null,{"$f":"IF('BİLGİ GİRİŞİ'!AJ46=\"\",\"\",'BİLGİ GİRİŞİ'!AJ46)","v":""},null,null,{"$f":"IF('BİLGİ GİRİŞİ'!AN46=\"\",\"\",'BİLGİ GİRİŞİ'!AN46)","v":""},null,null,{"$f":"IF('BİLGİ GİRİŞİ'!AR46=\"\",\"\",'BİLGİ GİRİŞİ'!AR46)","v":""},null,null,{"$f":"IF('BİLGİ GİRİŞİ'!AV46=\"\",\"\",'BİLGİ GİRİŞİ'!AV46)","v":""},null,null,"",null,null,""]
[{"$f":"IF('BİLGİ GİRİŞİ'!D47=\"\",\"\",'BİLGİ GİRİŞİ'!D47)","v":""},{"$f":"IF('BİLGİ GİRİŞİ'!E47=\"\",\"\",'BİLGİ GİRİŞİ'!E47)","v":""},null,null,null,null,null,null,null,null,null,null,null,null,null,{"$f":"IF('BİLGİ GİRİŞİ'!W47=\"\",\"\",'BİLGİ GİRİŞİ'!W47)","v":""},null,null,null,{"$f":"IF('BİLGİ GİRİŞİ'!T47=\"\",\"\",'BİLGİ GİRİŞİ'!T47)","v":""},null,null,null,{"$f":"IF('BİLGİ GİRİŞİ'!AB47=\"\",\"\",'BİLGİ GİRİŞİ'!AB47)","v":""},null,null,{"$f":"IF('BİLGİ GİRİŞİ'!AF47=\"\",\"\",'BİLGİ GİRİŞİ'!AF47)","v":""},null,null,{"$f":"IF('BİLGİ GİRİŞİ'!AJ47=\"\",\"\",'BİLGİ GİRİŞİ'!AJ47)","v":""},null,null,{"$f":"IF('BİLGİ GİRİŞİ'!AN47=\"\",\"\",'BİLGİ GİRİŞİ'!AN47)","v":""},null,null,{"$f":"IF('BİLGİ GİRİŞİ'!AR47=\"\",\"\",'BİLGİ GİRİŞİ'!AR47)","v":""},null,null,{"$f":"IF('BİLGİ GİRİŞİ'!AV47=\"\",\"\",'BİLGİ GİRİŞİ'!AV47)","v":""},null,null,"",null,null,""]
[{"$f":"IF('BİLGİ GİRİŞİ'!D48=\"\",\"\",'BİLGİ GİRİŞİ'!D48)","v":""},{"$f":"IF('BİLGİ GİRİŞİ'!E48=\"\",\"\",'BİLGİ GİRİŞİ'!E48)","v":""},null,null,null,null,null,null,null,null,null,null,null,null,null,{"$f":"IF('BİLGİ GİRİŞİ'!W48=\"\",\"\",'BİLGİ GİRİŞİ'!W48)","v":""},null,null,null,{"$f":"IF('BİLGİ GİRİŞİ'!T48=\"\",\"\",'BİLGİ GİRİŞİ'!T48)","v":""},null,null,null,{"$f":"IF('BİLGİ GİRİŞİ'!AB48=\"\",\"\",'BİLGİ GİRİŞİ'!AB48)","v":""},null,null,{"$f":"IF('BİLGİ GİRİŞİ'!AF48=\"\",\"\",'BİLGİ GİRİŞİ'!AF48)","v":""},null,null,{"$f":"IF('BİLGİ GİRİŞİ'!AJ48=\"\",\"\",'BİLGİ GİRİŞİ'!AJ48)","v":""},null,null,{"$f":"IF('BİLGİ GİRİŞİ'!AN48=\"\",\"\",'BİLGİ GİRİŞİ'!AN48)","v":""},null,null,{"$f":"IF('BİLGİ GİRİŞİ'!AR48=\"\",\"\",'BİLGİ GİRİŞİ'!AR48)","v":""},null,null,{"$f":"IF('BİLGİ GİRİŞİ'!AV48=\"\",\"\",'BİLGİ GİRİŞİ'!AV48)","v":""},null,null,"",null,null,""]
[{"$f":"IF('BİLGİ GİRİŞİ'!D49=\"\",\"\",'BİLGİ GİRİŞİ'!D49)","v":""},{"$f":"IF('BİLGİ GİRİŞİ'!E49=\"\",\"\",'BİLGİ GİRİŞİ'!E49)","v":""},null,null,null,null,null,null,null,null,null,null,null,null,null,{"$f":"IF('BİLGİ GİRİŞİ'!W49=\"\",\"\",'BİLGİ GİRİŞİ'!W49)","v":""},null,null,null,{"$f":"IF('BİLGİ GİRİŞİ'!T49=\"\",\"\",'BİLGİ GİRİŞİ'!T49)","v":""},null,null,null,{"$f":"IF('BİLGİ GİRİŞİ'!AB49=\"\",\"\",'BİLGİ GİRİŞİ'!AB49)","v":""},null,null,{"$f":"IF('BİLGİ GİRİŞİ'!AF49=\"\",\"\",'BİLGİ GİRİŞİ'!AF49)","v":""},null,null,{"$f":"IF('BİLGİ GİRİŞİ'!AJ49=\"\",\"\",'BİLGİ GİRİŞİ'!AJ49)","v":""},null,null,{"$f":"IF('BİLGİ GİRİŞİ'!AN49=\"\",\"\",'BİLGİ GİRİŞİ'!AN49)","v":""},null,null,{"$f":"IF('BİLGİ GİRİŞİ'!AR49=\"\",\"\",'BİLGİ GİRİŞİ'!AR49)","v":""},null,null,{"$f":"IF('BİLGİ GİRİŞİ'!AV49=\"\",\"\",'BİLGİ GİRİŞİ'!AV49)","v":""},null,null,"",null,null,""]
["TOPLAM (KDV Hariç)",null,null,null,null,null,null,null,null,null,null,null,null,null,null,null,null,null,null,null,null,null,null,{"$f":"SUM(X16:X35)","v":33000},null,null,{"$f":"SUM(AA16:AA35)","v":422000},null,null,{"$f":"SUM(AD16:AD35)","v":27000},null,null,{"$f":"SUM(AG16:AG35)","v":354000},null,null,{"$f":"SUM(AJ16:AJ35)","v":30000},null,null,{"$f":"SUM(AM16:AM35)","v":388000},null,null,{"$f":"SUM(AP16:AP35)","v":30000},null,null,{"$f":"SUM(AS16:AS35)","v":388000}]
[]
["        Piyasa araştırması sonucu yaklaşık  maliyet, KDV hariç",null,null,null,null,null,null,null,null,null,null,null,null,null,null,null,null,null,{"$f":"IF(AS36=\"\",\"\",AS36)","v":388000},null,null,null,null,null,"Türk Lirası olarak hesaplanmış olup iş bu cetvel tarafımızca imza altına alınmıştır."]
[]
[]
[null,{"$f":"IF(B44=\"\",\"\",IF('BİLGİ GİRİŞİ'!AB16=\"\",\"\",'BİLGİ GİRİŞİ'!AB16))","v":"Piyasa Araştırma Görevlisi"},null,null,null,null,null,null,null,null,null,null,{"$f":"IF(M44=\"\",\"\",IF('BİLGİ GİRİŞİ'!AH16=\"\",\"\",'BİLGİ GİRİŞİ'!AH16))","v":"Piyasa Araştırma Görevlisi"},null,null,null,null,null,null,null,null,null,null,{"$f":"IF(X44=\"\",\"\",IF('BİLGİ GİRİŞİ'!AN16=\"\",\"\",'BİLGİ GİRİŞİ'!AN16))","v":""},null,null,null,null,null,null,null,null,null,null,{"$f":"IF(AI44=\"\",\"\",IF('BİLGİ GİRİŞİ'!AT16=\"\",\"\",'BİLGİ GİRİŞİ'!AT16))","v":"OLUR/UYGUNDUR"}]
[null,null,null,null,null,null,null,null,null,null,null,null,null,null,null,null,null,null,null,null,null,null,null,null,null,null,null,null,null,null,null,null,null,null,{"$f":"IF(AI44=\"\",\"\",IF('BİLGİ GİRİŞİ'!O17=\"\",\"….../….../….…..\",'BİLGİ GİRİŞİ'!O17))","v":"2023-03-07"}]
[]
[null,{"$f":"IF('BİLGİ GİRİŞİ'!AB17=\"\",\"\",'BİLGİ GİRİŞİ'!AB17)","v":"Ahmet DEMİR"},null,null,null,null,null,null,null,null,null,null,{"$f":"IF('BİLGİ GİRİŞİ'!AH17=\"\",\"\",'BİLGİ GİRİŞİ'!AH17)","v":"Ayşe YILDIZ"},null,null,null,null,null,null,null,null,null,null,{"$f":"IF('BİLGİ GİRİŞİ'!AN17=\"\",\"\",'BİLGİ GİRİŞİ'!AN17)","v":""},null,null,null,null,null,null,null,null,null,null,{"$f":"IF('BİLGİ GİRİŞİ'!AT17=\"\",\"\",'BİLGİ GİRİŞİ'!AT17)","v":"Mustafa AYDIN"}]
[null,{"$f":"IF(B44=\"\",\"\",IF('BİLGİ GİRİŞİ'!AB18=\"\",\"\",'BİLGİ GİRİŞİ'!AB18))","v":"Müdür Yardımcısı 1"},null,null,null,null,null,null,null,null,null,null,{"$f":"IF(M44=\"\",\"\",IF('BİLGİ GİRİŞİ'!AH18=\"\",\"\",'BİLGİ GİRİŞİ'!AH18))","v":"Öğretmen 1"},null,null,null,null,null,null,null,null,null,null,{"$f":"IF(X44=\"\",\"\",IF('BİLGİ GİRİŞİ'!AN18=\"\",\"\",'BİLGİ GİRİŞİ'!AN18))","v":""},null,null,null,null,null,null,null,null,null,null,{"$f":"IF(AI44=\"\",\"\",IF('BİLGİ GİRİŞİ'!AT18=\"\",\"\",'BİLGİ GİRİŞİ'!AT18))","v":"Okul Müdürü"}]

{"sheet":"4","index":5,"n_rows":38,"n_cols":17,"rows_kept":38,"cut":false,"hidden":false,"merged":[[14,0,14,14],[14,15,14,30],[23,0,23,30],[24,0,27,14],[28,0,28,14],[15,0,15,14],[15,15,15,30],[16,0,16,14],[16,15,16,30],[18,0,18,14],[18,15,18,30],[19,0,19,14],[19,15,19,30],[22,0,22,30],[17,0,17,14],[17,15,17,30],[1,0,2,30],[3,0,3,10],[3,11,3,30],[4,0,4,10],[4,11,4,14],[4,16,4,30],[5,0,5,30],[7,0,7,30],[9,0,9,14],[9,15,9,30],[8,0,8,14],[8,15,8,30],[6,0,6,30],[10,0,10,14],[10,15,10,30],[11,0,11,14],[11,15,11,30],[13,0,13,14],[13,15,13,30],[12,0,12,30],[21,0,21,30],[34,0,34,14],[27,15,27,30],[28,15,28,30],[30,0,30,14],[32,0,32,14],[32,15,32,30],[33,0,33,14],[33,15,33,30]]}
[]
["DOĞRUDAN TEMİN ONAY BELGESİ"]
[]
["ALIMI YAPAN İDARENİN ADI",null,null,null,null,null,null,null,null,null,null,{"$f":"IF('BİLGİ GİRİŞİ'!O8=\"\",\"\",'BİLGİ GİRİŞİ'!O8)","v":"Atatürk İlkokulu Müdürlüğü"}]
["BELGE TARİH VE SAYISI",null,null,null,null,null,null,null,null,null,null,{"$f":"IF('BİLGİ GİRİŞİ'!O18=\"\",\"…../…../……..\",'BİLGİ GİRİŞİ'!O18)","v":"2023-03-06"},null,null,null,"/",{"$f":"IF('BİLGİ GİRİŞİ'!S15=\"\",\"….......................................\",'BİLGİ GİRİŞİ'!S15)","v":456789123}]
[{"$f":"UPPER(IF('BİLGİ GİRİŞİ'!O8=\"\",\"\",'BİLGİ GİRİŞİ'!O8))","v":"ATATÜRK İLKOKULU MÜDÜRLÜĞÜ"}]
["HARCAMA YETKİLİSİ MAKAMINA"]
["DOĞRUDAN TEMİN İLE İLGİLİ BİLGİLER"]
["DOĞRUDAN TEMİN NUMARASI",null,null,null,null,null,null,null,null,null,null,null,null,null,null,{"$f":"IF('BİLGİ GİRİŞİ'!O11=\"\",\"\",'BİLGİ GİRİŞİ'!O11)","v":"22DT1211930"}]
["İŞİN ADI",null,null,null,null,null,null,null,null,null,null,null,null,null,null,{"$f":"IF('BİLGİ GİRİŞİ'!O9=\"\",\"\",'BİLGİ GİRİŞİ'!O9)","v":"Bilişim Malzemeleri Alımı"}]
["TEMİN ŞEKLİ",null,null,null,null,null,null,null,null,null,null,null,null,null,null,{"$f":"IF('BİLGİ GİRİŞİ'!O10=\"\",\"\",'BİLGİ GİRİŞİ'!O10)","v":"22/d"}]
["İŞİN TÜRÜ",null,null,null,null,null,null,null,null,null,null,null,null,null,null,"Mal Alımı/Hizmet Alımı/Yapım İşi"]
[]
["KULLANILABİLİR ÖDENEK TUTARI",null,null,null,null,null,null,null,null,null,null,null,null,null,null,{"$f":"IF('BİLGİ GİRİŞİ'!AJ13=\"\",\"\",'BİLGİ GİRİŞİ'!AJ13)","v":45000}]
["YAKLAŞIK MALİYET",null,null,null,null,null,null,null,null,null,null,null,null,null,null,{"$f":"IF('3'!AS36=\"\",\"\",'3'!AS36)","v":388000}]
["YATIRIM/PROJE NUMARASI (Varsa)"]
["BÜTÇE TERTİBİ (Varsa)",null,null,null,null,null,null,null,null,null,null,null,null,null,null,{"$f":"IF('BİLGİ GİRİŞİ'!AJ12=\"\",\"\",'BİLGİ GİRİŞİ'!AJ12)","v":"6.98.255.9436.13.67.01.03.05.30.02"}]
["FİYAT FARKI VERİLECEKSE ŞARTLARI",null,null,null,null,null,null,null,null,null,null,null,null,null,null,"Verilmeyecektir."]
["AVANS VERİLECEKSE ŞARTLARI",null,null,null,null,null,null,null,null,null,null,null,null,null,null,"Verilmeyecektir."]
["DOKÜMAN HAZIRLANIP HAZIRLANMAYACAĞI",null,null,null,null,null,null,null,null,null,null,null,null,null,null,"Hazırlanmayacaktır."]
[]
[" DOĞRUDAN TEMİN İLE İLGİLİ DİĞER AÇIKLAMALAR"]
["….........."]
["ONAY"]
[{"$f":"CONCATENATE(\"       \",\"Yukarıda belirtilen  işin  Kamu İhale Kanunu'nun  \",IF('BİLGİ GİRİŞİ'!O10=\"\",\".............................................................................\",'BİLGİ GİRİŞİ'!O10),\" maddesine göre Doğrudan Temin yoluyla satın alınması hususunu;\")","v":"       Yukarıda belirtilen  işin  Kamu İhale Kanunu'nun  22/d maddesine göre Doğrudan Temin yoluyla satın alınması hususunu;"}]
[]
[]
[null,null,null,null,null,null,null,null,null,null,null,null,null,null,null,{"$f":"IF(P33=\"\",\"\",IF('BİLGİ GİRİŞİ'!AT16=\"\",\"\",'BİLGİ GİRİŞİ'!AT16))","v":"OLUR/UYGUNDUR"}]
["    Olurlarınıza arz ederim.",null,null,null,null,null,null,null,null,null,null,null,null,null,null,{"$f":"IF(P33=\"\",\"\",IF('BİLGİ GİRİŞİ'!O18=\"\",\"…../…../……..\",'BİLGİ GİRİŞİ'!O18))","v":"2023-03-06"}]
[]
[{"$f":"IF(A34=\"\",\"\",IF('BİLGİ GİRİŞİ'!O18=\"\",\"…../…../……..\",'BİLGİ GİRİŞİ'!O18))","v":"2023-03-06"}]
[]
[null,null,null,null,null,null,null,null,null,null,null,null,null,null,null,{"$f":"IF('BİLGİ GİRİŞİ'!AT17=\"\",\"\",'BİLGİ GİRİŞİ'!AT17)","v":"Mustafa AYDIN"}]
[{"$f":"IF('BİLGİ GİRİŞİ'!AB17=\"\",\"\",'BİLGİ GİRİŞİ'!AB17)","v":"Ahmet DEMİR"},null,null,null,null,null,null,null,null,null,null,null,null,null,null,{"$f":"IF(P33=\"\",\"\",IF('BİLGİ GİRİŞİ'!AT18=\"\",\"\",'BİLGİ GİRİŞİ'!AT18))","v":"Okul Müdürü"}]
[{"$f":"IF(A34=\"\",\"\",IF('BİLGİ GİRİŞİ'!AB18=\"\",\"\",'BİLGİ GİRİŞİ'!AB18))","v":"Müdür Yardımcısı 1"}]
[]
[]
["Ek:İdare Tarafından Hazırlanan Yaklaşık Maliyet Hesap Cetveli"]

{"sheet":"5","index":6,"n_rows":54,"n_cols":28,"rows_kept":54,"cut":false,"hidden":false,"merged":[[1,0,1,30],[2,0,2,30],[3,0,3,30],[5,0,5,2],[5,4,5,22],[5,25,5,30],[23,0,23,30],[29,0,29,30],[30,1,30,14],[30,15,30,18],[30,19,30,22],[30,23,30,26],[30,27,30,30],[6,0,6,2],[6,4,6,26],[8,0,8,30],[10,0,11,30],[12,0,14,30],[15,0,15,30],[18,0,18,9],[19,0,19,9],[18,20,18,30],[19,20,19,30],[18,10,18,19],[19,10,19,19],[20,10,20,19],[20,20,20,30],[31,1,31,14],[31,19,31,22],[31,15,31,18],[31,23,31,26],[31,27,31,30],[32,1,32,14],[32,19,32,22],[32,15,32,18],[32,23,32,26],[32,27,32,30],[20,0,20,9],[25,0,26,30],[27,0,27,30],[33,1,33,14],[33,19,33,22],[33,15,33,18],[33,23,33,26],[33,27,33,30],[34,1,34,14],[34,15,34,18],[34,19,34,22],[34,23,34,26],[34,27,34,30],[35,1,35,14],[35,15,35,18],[35,19,35,22],[35,23,35,26],[35,27,35,30],[36,1,36,14],[36,15,36,18],[36,19,36,22],[36,23,36,26],[36,27,36,30],[37,1,37,14],[37,15,37,18],[37,19,37,22],[37,23,37,26],[37,27,37,30],[38,1,38,14],[38,15,38,18],[38,19,38,22],[38,23,38,26],[38,27,38,30],[39,1,39,14],[39,15,39,18],[39,19,39,22],[39,23,39,26],[39,27,39,30],[40,1,40,14],[40,15,40,18],[40,19,40,22],[40,23,40,26],[40,27,40,30],[41,1,41,14],[41,15,41,18],[41,19,41,22],[41,23,41,26],[41,27,41,30],[42,1,42,14],[42,15,42,18],[42,19,42,22],[42,23,42,26],[42,27,42,30],[51,23,51,26],[51,27,51,30],[43,1,43,14],[43,15,43,18],[43,19,43,22],[43,23,43,26],[43,27,43,30],[44,1,44,14],[44,15,44,18],[44,19,44,22],[44,23,44,26],[44,27,44,30],[49,1,49,14],[49,15,49,18],[49,19,49,22],[49,23,49,26],[49,27,49,30],[47,1,47,14],[47,15,47,18],[47,19,47,22],[53,20,53,30],[50,1,50,14],[50,15,50,18],[50,19,50,22],[50,23,50,26],[50,27,50,30],[45,23,45,26],[45,27,45,30],[46,1,46,14],[46,15,46,18],[46,19,46,22],[46,23,46,26],[46,27,46,30],[45,1,45,14],[45,15,45,18],[45,19,45,22],[47,23,47,26],[47,27,47,30],[48,1,48,14],[48,15,48,18],[48,19,48,22],[48,23,48,26],[48,27,48,30],[51,0,51,22]]}
[]
["T.C."]
[{"$f":"IF('BİLGİ GİRİŞİ'!O7=\"\",\"\",'BİLGİ GİRİŞİ'!O7)","v":"BULANIK KAYMAKAMLIĞI"}]
[{"$f":"IF('BİLGİ GİRİŞİ'!O8=\"\",\"\",'BİLGİ GİRİŞİ'!O8)","v":"Atatürk İlkokulu Müdürlüğü"}]
[]
["Sayı",null,null,":",{"$f":"IF('BİLGİ GİRİŞİ'!S15=\"\",\"\",'BİLGİ GİRİŞİ'!S15)","v":456789123},null,null,null,null,null,null,null,null,null,null,null,null,null,null,null,null,null,null,null,null,{"$f":"IF('BİLGİ GİRİŞİ'!O19=\"\",\"…../…../……..\",'BİLGİ GİRİŞİ'!O19)","v":"2023-03-06"}]
["Konu",null,null,":","Teklif Vermeye Davet"]
[]
["İLGİLİ GERÇEK/TÜZEL KİŞİLERE"]
[]
[{"$f":"CONCATENATE(\"       \",\"Kurumumuz ihtiyaçlarında kullanılmak üzere aşağıda bilgileri verilen Mal/Hizmet/Yapım İşi,  Kamu İhale Kanunu'nun \",IF('BİLGİ GİRİŞİ'!O10=\"\",\".............................................................................\",'BİLGİ GİRİŞİ'!O10),\" maddesine göre Doğrudan Temin yoluyla satın alınacaktır.\")","v":"       Kurumumuz ihtiyaçlarında kullanılmak üzere aşağıda bilgileri verilen Mal/Hizmet/Yapım İşi,  Kamu İhale Kanunu'nun 22/d maddesine göre Doğrudan Temin yoluyla satın alınacaktır."}]
[]
[{"$f":"CONCATENATE(\"        İlgilenmeniz halinde aşağıda bilgileri verilen Mal/Hizmet/Yapım İşi'ne ilişkin, KDV hariç teklifinizi içeren birim fiyat ve toplam fiyatlarının karşılarına yazılarak \",  TEXT(IF('BİLGİ GİRİŞİ'!O20=\"\",\"…../…../……..\",'BİLGİ GİRİŞİ'!O20),\"gg.aa.yyyy \"),   \" tarihi mesai bitimine kadar Kurumumuza gönderilmesi hususunda;\")","v":"        İlgilenmeniz halinde aşağıda bilgileri verilen Mal/Hizmet/Yapım İşi'ne ilişkin, KDV hariç teklifinizi içeren birim fiyat ve toplam fiyatlarının karşılarına yazılarak 08.03.2023  tarihi mesai bitimine kadar Kurumumuza gönderilmesi hususunda;"}]
[]
[]
["        Gereğini rica ederim/ederiz."]
[]
[]
[{"$f":"IF(A20=\"\",\"\",IF('BİLGİ GİRİŞİ'!AH16=\"\",\"\",'BİLGİ GİRİŞİ'!AH16))","v":"Piyasa Araştırma Görevlisi"},null,null,null,null,null,null,null,null,null,{"$f":"IF(K20=\"\",\"\",IF('BİLGİ GİRİŞİ'!AN16=\"\",\"\",'BİLGİ GİRİŞİ'!AN16))","v":""},null,null,null,null,null,null,null,null,null,{"$f":"IF(U20=\"\",\"\",IF('BİLGİ GİRİŞİ'!AB16=\"\",\"\",'BİLGİ GİRİŞİ'!AB16))","v":"Piyasa Araştırma Görevlisi"}]
[{"$f":"IF('BİLGİ GİRİŞİ'!AH17=\"\",\"\",'BİLGİ GİRİŞİ'!AH17)","v":"Ayşe YILDIZ"},null,null,null,null,null,null,null,null,null,{"$f":"IF('BİLGİ GİRİŞİ'!AN17=\"\",\"\",'BİLGİ GİRİŞİ'!AN17)","v":""},null,null,null,null,null,null,null,null,null,{"$f":"IF('BİLGİ GİRİŞİ'!AB17=\"\",\"\",'BİLGİ GİRİŞİ'!AB17)","v":"Ahmet DEMİR"}]
[{"$f":"IF('BİLGİ GİRİŞİ'!AH18=\"\",\"\",'BİLGİ GİRİŞİ'!AH18)","v":"Öğretmen 1"},null,null,null,null,null,null,null,null,null,{"$f":"IF(K20=\"\",\"\",IF('BİLGİ GİRİŞİ'!AN18=\"\",\"\",'BİLGİ GİRİŞİ'!AN18))","v":""},null,null,null,null,null,null,null,null,null,{"$f":"IF('BİLGİ GİRİŞİ'!AB18=\"\",\"\",'BİLGİ GİRİŞİ'!AB18)","v":"Müdür Yardımcısı 1"}]
[]
[]
[{"$f":"IF('BİLGİ GİRİŞİ'!O8=\"\",\"\",CONCATENATE(UPPER('BİLGİ GİRİŞİ'!O8),\"\",UPPER(IF('BİLGİ GİRİŞİ'!O8=\"\",\"\",'BİLGİ GİRİŞİ'!AN8))))","v":"ATATÜRK İLKOKULU MÜDÜRLÜĞÜNE"}]
[]
["          Kurumunuzca satın alınacak Mal/Hizmet/Yapım İşi'ne ilişkin teklifimizi içeren birim fiyatlar ve toplam fiyatlar aşağıya çıkarılmıştır."]
[]
["         Gereğini arz ederim/ederiz."]
[]
["MAL'IN/HİZMET'İN/YAPIM İŞİ'NİN"]
["S","Kalem/KısımBilgileri",null,null,null,null,null,null,null,null,null,null,null,null,null,"Birimi",null,null,null,"Miktarı",null,null,null,"Birim Fiyatı",null,null,null,"Toplam Fiyatı"]
[{"$f":"IF('BİLGİ GİRİŞİ'!D30=\"\",\"\",'BİLGİ GİRİŞİ'!D30)","v":1},{"$f":"IF('BİLGİ GİRİŞİ'!E30=\"\",\"\",'BİLGİ GİRİŞİ'!E30)","v":"AIO (All In One) Masaüstü Bilgisayar "},null,null,null,null,null,null,null,null,null,null,null,null,null,{"$f":"IF('BİLGİ GİRİŞİ'!W30=\"\",\"\",'BİLGİ GİRİŞİ'!W30)","v":"Adet"},null,null,null,{"$f":"IF('BİLGİ GİRİŞİ'!T30=\"\",\"\",IF('BİLGİ GİRİŞİ'!$BO$28=1,\"1\",'BİLGİ GİRİŞİ'!T30))","v":"1"}]
[{"$f":"IF('BİLGİ GİRİŞİ'!D31=\"\",\"\",'BİLGİ GİRİŞİ'!D31)","v":2},{"$f":"IF('BİLGİ GİRİŞİ'!E31=\"\",\"\",'BİLGİ GİRİŞİ'!E31)","v":"Fotokopi Makinesi"},null,null,null,null,null,null,null,null,null,null,null,null,null,{"$f":"IF('BİLGİ GİRİŞİ'!W31=\"\",\"\",'BİLGİ GİRİŞİ'!W31)","v":"Adet"},null,null,null,{"$f":"IF('BİLGİ GİRİŞİ'!T31=\"\",\"\",IF('BİLGİ GİRİŞİ'!$BO$28=1,\"1\",'BİLGİ GİRİŞİ'!T31))","v":"1"}]
[{"$f":"IF('BİLGİ GİRİŞİ'!D32=\"\",\"\",'BİLGİ GİRİŞİ'!D32)","v":3},{"$f":"IF('BİLGİ GİRİŞİ'!E32=\"\",\"\",'BİLGİ GİRİŞİ'!E32)","v":"Projektör"},null,null,null,null,null,null,null,null,null,null,null,null,null,{"$f":"IF('BİLGİ GİRİŞİ'!W32=\"\",\"\",'BİLGİ GİRİŞİ'!W32)","v":"Adet"},null,null,null,{"$f":"IF('BİLGİ GİRİŞİ'!T32=\"\",\"\",IF('BİLGİ GİRİŞİ'!$BO$28=1,\"1\",'BİLGİ GİRİŞİ'!T32))","v":"1"}]
[{"$f":"IF('BİLGİ GİRİŞİ'!D33=\"\",\"\",'BİLGİ GİRİŞİ'!D33)","v":""},{"$f":"IF('BİLGİ GİRİŞİ'!E33=\"\",\"\",'BİLGİ GİRİŞİ'!E33)","v":""},null,null,null,null,null,null,null,null,null,null,null,null,null,{"$f":"IF('BİLGİ GİRİŞİ'!W33=\"\",\"\",'BİLGİ GİRİŞİ'!W33)","v":""},null,null,null,{"$f":"IF('BİLGİ GİRİŞİ'!T33=\"\",\"\",IF('BİLGİ GİRİŞİ'!$BO$28=1,\"1\",'BİLGİ GİRİŞİ'!T33))","v":""}]
[{"$f":"IF('BİLGİ GİRİŞİ'!D34=\"\",\"\",'BİLGİ GİRİŞİ'!D34)","v":""},{"$f":"IF('BİLGİ GİRİŞİ'!E34=\"\",\"\",'BİLGİ GİRİŞİ'!E34)","v":""},null,null,null,null,null,null,null,null,null,null,null,null,null,{"$f":"IF('BİLGİ GİRİŞİ'!W34=\"\",\"\",'BİLGİ GİRİŞİ'!W34)","v":""},null,null,null,{"$f":"IF('BİLGİ GİRİŞİ'!T34=\"\",\"\",IF('BİLGİ GİRİŞİ'!$BO$28=1,\"1\",'BİLGİ GİRİŞİ'!T34))","v":""}]
[{"$f":"IF('BİLGİ GİRİŞİ'!D35=\"\",\"\",'BİLGİ GİRİŞİ'!D35)","v":""},{"$f":"IF('BİLGİ GİRİŞİ'!E35=\"\",\"\",'BİLGİ GİRİŞİ'!E35)","v":""},null,null,null,null,null,null,null,null,null,null,null,null,null,{"$f":"IF('BİLGİ GİRİŞİ'!W35=\"\",\"\",'BİLGİ GİRİŞİ'!W35)","v":""},null,null,null,{"$f":"IF('BİLGİ GİRİŞİ'!T35=\"\",\"\",IF('BİLGİ GİRİŞİ'!$BO$28=1,\"1\",'BİLGİ GİRİŞİ'!T35))","v":""}]
[{"$f":"IF('BİLGİ GİRİŞİ'!D36=\"\",\"\",'BİLGİ GİRİŞİ'!D36)","v":""},{"$f":"IF('BİLGİ GİRİŞİ'!E36=\"\",\"\",'BİLGİ GİRİŞİ'!E36)","v":""},null,null,null,null,null,null,null,null,null,null,null,null,null,{"$f":"IF('BİLGİ GİRİŞİ'!W36=\"\",\"\",'BİLGİ GİRİŞİ'!W36)","v":""},null,null,null,{"$f":"IF('BİLGİ GİRİŞİ'!T36=\"\",\"\",IF('BİLGİ GİRİŞİ'!$BO$28=1,\"1\",'BİLGİ GİRİŞİ'!T36))","v":""}]
[{"$f":"IF('BİLGİ GİRİŞİ'!D37=\"\",\"\",'BİLGİ GİRİŞİ'!D37)","v":""},{"$f":"IF('BİLGİ GİRİŞİ'!E37=\"\",\"\",'BİLGİ GİRİŞİ'!E37)","v":""},null,null,null,null,null,null,null,null,null,null,null,null,null,{"$f":"IF('BİLGİ GİRİŞİ'!W37=\"\",\"\",'BİLGİ GİRİŞİ'!W37)","v":""},null,null,null,{"$f":"IF('BİLGİ GİRİŞİ'!T37=\"\",\"\",IF('BİLGİ GİRİŞİ'!$BO$28=1,\"1\",'BİLGİ GİRİŞİ'!T37))","v":""}]
[{"$f":"IF('BİLGİ GİRİŞİ'!D38=\"\",\"\",'BİLGİ GİRİŞİ'!D38)","v":""},{"$f":"IF('BİLGİ GİRİŞİ'!E38=\"\",\"\",'BİLGİ GİRİŞİ'!E38)","v":""},null,null,null,null,null,null,null,null,null,null,null,null,null,{"$f":"IF('BİLGİ GİRİŞİ'!W38=\"\",\"\",'BİLGİ GİRİŞİ'!W38)","v":""},null,null,null,{"$f":"IF('BİLGİ GİRİŞİ'!T38=\"\",\"\",IF('BİLGİ GİRİŞİ'!$BO$28=1,\"1\",'BİLGİ GİRİŞİ'!T38))","v":""}]
[{"$f":"IF('BİLGİ GİRİŞİ'!D39=\"\",\"\",'BİLGİ GİRİŞİ'!D39)","v":""},{"$f":"IF('BİLGİ GİRİŞİ'!E39=\"\",\"\",'BİLGİ GİRİŞİ'!E39)","v":""},null,null,null,null,null,null,null,null,null,null,null,null,null,{"$f":"IF('BİLGİ GİRİŞİ'!W39=\"\",\"\",'BİLGİ GİRİŞİ'!W39)","v":""},null,null,null,{"$f":"IF('BİLGİ GİRİŞİ'!T39=\"\",\"\",IF('BİLGİ GİRİŞİ'!$BO$28=1,\"1\",'BİLGİ GİRİŞİ'!T39))","v":""}]
[{"$f":"IF('BİLGİ GİRİŞİ'!D40=\"\",\"\",'BİLGİ GİRİŞİ'!D40)","v":""},{"$f":"IF('BİLGİ GİRİŞİ'!E40=\"\",\"\",'BİLGİ GİRİŞİ'!E40)","v":""},null,null,null,null,null,null,null,null,null,null,null,null,null,{"$f":"IF('BİLGİ GİRİŞİ'!W40=\"\",\"\",'BİLGİ GİRİŞİ'!W40)","v":""},null,null,null,{"$f":"IF('BİLGİ GİRİŞİ'!T40=\"\",\"\",IF('BİLGİ GİRİŞİ'!$BO$28=1,\"1\",'BİLGİ GİRİŞİ'!T40))","v":""}]
[{"$f":"IF('BİLGİ GİRİŞİ'!D41=\"\",\"\",'BİLGİ GİRİŞİ'!D41)","v":""},{"$f":"IF('BİLGİ GİRİŞİ'!E41=\"\",\"\",'BİLGİ GİRİŞİ'!E41)","v":""},null,null,null,null,null,null,null,null,null,null,null,null,null,{"$f":"IF('BİLGİ GİRİŞİ'!W41=\"\",\"\",'BİLGİ GİRİŞİ'!W41)","v":""},null,null,null,{"$f":"IF('BİLGİ GİRİŞİ'!T41=\"\",\"\",IF('BİLGİ GİRİŞİ'!$BO$28=1,\"1\",'BİLGİ GİRİŞİ'!T41))","v":""}]
[{"$f":"IF('BİLGİ GİRİŞİ'!D42=\"\",\"\",'BİLGİ GİRİŞİ'!D42)","v":""},{"$f":"IF('BİLGİ GİRİŞİ'!E42=\"\",\"\",'BİLGİ GİRİŞİ'!E42)","v":""},null,null,null,null,null,null,null,null,null,null,null,null,null,{"$f":"IF('BİLGİ GİRİŞİ'!W42=\"\",\"\",'BİLGİ GİRİŞİ'!W42)","v":""},null,null,null,{"$f":"IF('BİLGİ GİRİŞİ'!T42=\"\",\"\",IF('BİLGİ GİRİŞİ'!$BO$28=1,\"1\",'BİLGİ GİRİŞİ'!T42))","v":""}]
[{"$f":"IF('BİLGİ GİRİŞİ'!D43=\"\",\"\",'BİLGİ GİRİŞİ'!D43)","v":""},{"$f":"IF('BİLGİ GİRİŞİ'!E43=\"\",\"\",'BİLGİ GİRİŞİ'!E43)","v":""},null,null,null,null,null,null,null,null,null,null,null,null,null,{"$f":"IF('BİLGİ GİRİŞİ'!W43=\"\",\"\",'BİLGİ GİRİŞİ'!W43)","v":""},null,null,null,{"$f":"IF('BİLGİ GİRİŞİ'!T43=\"\",\"\",IF('BİLGİ GİRİŞİ'!$BO$28=1,\"1\",'BİLGİ GİRİŞİ'!T43))","v":""}]
[{"$f":"IF('BİLGİ GİRİŞİ'!D44=\"\",\"\",'BİLGİ GİRİŞİ'!D44)","v":""},{"$f":"IF('BİLGİ GİRİŞİ'!E44=\"\",\"\",'BİLGİ GİRİŞİ'!E44)","v":""},null,null,null,null,null,null,null,null,null,null,null,null,null,{"$f":"IF('BİLGİ GİRİŞİ'!W44=\"\",\"\",'BİLGİ GİRİŞİ'!W44)","v":""},null,null,null,{"$f":"IF('BİLGİ GİRİŞİ'!T44=\"\",\"\",IF('BİLGİ GİRİŞİ'!$BO$28=1,\"1\",'BİLGİ GİRİŞİ'!T44))","v":""}]
[{"$f":"IF('BİLGİ GİRİŞİ'!D45=\"\",\"\",'BİLGİ GİRİŞİ'!D45)","v":""},{"$f":"IF('BİLGİ GİRİŞİ'!E45=\"\",\"\",'BİLGİ GİRİŞİ'!E45)","v":""},null,null,null,null,null,null,null,null,null,null,null,null,null,{"$f":"IF('BİLGİ GİRİŞİ'!W45=\"\",\"\",'BİLGİ GİRİŞİ'!W45)","v":""},null,null,null,{"$f":"IF('BİLGİ GİRİŞİ'!T45=\"\",\"\",IF('BİLGİ GİRİŞİ'!$BO$28=1,\"1\",'BİLGİ GİRİŞİ'!T45))","v":""}]
[{"$f":"IF('BİLGİ GİRİŞİ'!D46=\"\",\"\",'BİLGİ GİRİŞİ'!D46)","v":""},{"$f":"IF('BİLGİ GİRİŞİ'!E46=\"\",\"\",'BİLGİ GİRİŞİ'!E46)","v":""},null,null,null,null,null,null,null,null,null,null,null,null,null,{"$f":"IF('BİLGİ GİRİŞİ'!W46=\"\",\"\",'BİLGİ GİRİŞİ'!W46)","v":""},null,null,null,{"$f":"IF('BİLGİ GİRİŞİ'!T46=\"\",\"\",IF('BİLGİ GİRİŞİ'!$BO$28=1,\"1\",'BİLGİ GİRİŞİ'!T46))","v":""}]
[{"$f":"IF('BİLGİ GİRİŞİ'!D47=\"\",\"\",'BİLGİ GİRİŞİ'!D47)","v":""},{"$f":"IF('BİLGİ GİRİŞİ'!E47=\"\",\"\",'BİLGİ GİRİŞİ'!E47)","v":""},null,null,null,null,null,null,null,null,null,null,null,null,null,{"$f":"IF('BİLGİ GİRİŞİ'!W47=\"\",\"\",'BİLGİ GİRİŞİ'!W47)","v":""},null,null,null,{"$f":"IF('BİLGİ GİRİŞİ'!T47=\"\",\"\",IF('BİLGİ GİRİŞİ'!$BO$28=1,\"1\",'BİLGİ GİRİŞİ'!T47))","v":""}]
[{"$f":"IF('BİLGİ GİRİŞİ'!D48=\"\",\"\",'BİLGİ GİRİŞİ'!D48)","v":""},{"$f":"IF('BİLGİ GİRİŞİ'!E48=\"\",\"\",'BİLGİ GİRİŞİ'!E48)","v":""},null,null,null,null,null,null,null,null,null,null,null,null,null,{"$f":"IF('BİLGİ GİRİŞİ'!W48=\"\",\"\",'BİLGİ GİRİŞİ'!W48)","v":""},null,null,null,{"$f":"IF('BİLGİ GİRİŞİ'!T48=\"\",\"\",IF('BİLGİ GİRİŞİ'!$BO$28=1,\"1\",'BİLGİ GİRİŞİ'!T48))","v":""}]
[{"$f":"IF('BİLGİ GİRİŞİ'!D49=\"\",\"\",'BİLGİ GİRİŞİ'!D49)","v":""},{"$f":"IF('BİLGİ GİRİŞİ'!E49=\"\",\"\",'BİLGİ GİRİŞİ'!E49)","v":""},null,null,null,null,null,null,null,null,null,null,null,null,null,{"$f":"IF('BİLGİ GİRİŞİ'!W49=\"\",\"\",'BİLGİ GİRİŞİ'!W49)","v":""},null,null,null,{"$f":"IF('BİLGİ GİRİŞİ'!T49=\"\",\"\",IF('BİLGİ GİRİŞİ'!$BO$28=1,\"1\",'BİLGİ GİRİŞİ'!T49))","v":""}]
["TOPLAM (KDV Hariç)"]
[]
[null,null,null,null,null,null,null,null,null,null,null,null,null,null,null,null,null,null,null,null,"KİŞİ/FİRMA KAŞE/İMZA"]

{"sheet":"6","index":7,"n_rows":45,"n_cols":17,"rows_kept":45,"cut":false,"hidden":false,"merged":[[7,0,7,29],[1,0,1,9],[1,11,1,30],[2,0,2,9],[2,11,2,30],[3,0,3,9],[3,11,3,30],[4,0,4,9],[4,11,4,14],[4,16,4,30],[19,2,19,29],[8,2,8,29],[9,2,9,29],[10,2,10,29],[11,2,11,29],[12,2,12,29],[13,2,13,29],[14,2,14,29],[15,2,15,29],[16,2,16,29],[17,2,17,29],[18,2,18,29],[32,2,32,29],[20,2,20,29],[21,2,21,29],[22,2,22,29],[24,0,24,29],[25,2,25,29],[26,2,26,29],[27,2,27,29],[28,2,28,29],[29,2,29,29],[30,2,30,29],[31,2,31,29],[44,2,44,29],[33,2,33,29],[34,2,34,29],[35,2,35,29],[36,2,36,29],[37,2,37,29],[38,2,38,29],[39,2,39,29],[40,2,40,29],[41,2,41,29],[42,2,42,29],[43,2,43,29]]}
[]
["İdarenin Adı",null,null,null,null,null,null,null,null,null,":",{"$f":"IF('BİLGİ GİRİŞİ'!O8=\"\",\"\",'BİLGİ GİRİŞİ'!O8)","v":"Atatürk İlkokulu Müdürlüğü"}]
["Doğrudan Temin Numarası",null,null,null,null,null,null,null,null,null,":",{"$f":"IF('BİLGİ GİRİŞİ'!O11=\"\",\"\",'BİLGİ GİRİŞİ'!O11)","v":"22DT1211930"}]
["Mal/Hizmet/Yapım Adı, Niteliği ",null,null,null,null,null,null,null,null,null,":",{"$f":"IF('BİLGİ GİRİŞİ'!O9=\"\",\"\",'BİLGİ GİRİŞİ'!O9)","v":"Bilişim Malzemeleri Alımı"}]
["Alım/Görevlendirme Onay Tarihi/sayısı",null,null,null,null,null,null,null,null,null,":",{"$f":"IF('BİLGİ GİRİŞİ'!O15=\"\",\"\",'BİLGİ GİRİŞİ'!O15)","v":"2023-03-06"},null,null,null,"/",{"$f":"IF('BİLGİ GİRİŞİ'!S15=\"\",\"\",'BİLGİ GİRİŞİ'!S15)","v":456789123}]
[]
[]
["İDARİ ŞARTLAR"]
[{"$f":"IF('BİLGİ GİRİŞİ'!D86=\"\",\"\",'BİLGİ GİRİŞİ'!D86)","v":1},{"$f":"IF(C9=\"\",\"\",\"-\")","v":"-"},{"$f":"IF('BİLGİ GİRİŞİ'!E86=\"\",\"\",'BİLGİ GİRİŞİ'!E86)","v":"Bu bent boş bırakılmıştır."}]
[{"$f":"IF('BİLGİ GİRİŞİ'!D87=\"\",\"\",'BİLGİ GİRİŞİ'!D87)","v":""},{"$f":"IF(C10=\"\",\"\",\"-\")","v":""},{"$f":"IF('BİLGİ GİRİŞİ'!E87=\"\",\"\",'BİLGİ GİRİŞİ'!E87)","v":""}]
[{"$f":"IF('BİLGİ GİRİŞİ'!D88=\"\",\"\",'BİLGİ GİRİŞİ'!D88)","v":""},"",{"$f":"IF('BİLGİ GİRİŞİ'!E88=\"\",\"\",'BİLGİ GİRİŞİ'!E88)","v":""}]
[{"$f":"IF('BİLGİ GİRİŞİ'!D89=\"\",\"\",'BİLGİ GİRİŞİ'!D89)","v":""},"",{"$f":"IF('BİLGİ GİRİŞİ'!E89=\"\",\"\",'BİLGİ GİRİŞİ'!E89)","v":""}]
[{"$f":"IF('BİLGİ GİRİŞİ'!D90=\"\",\"\",'BİLGİ GİRİŞİ'!D90)","v":""},"",{"$f":"IF('BİLGİ GİRİŞİ'!E90=\"\",\"\",'BİLGİ GİRİŞİ'!E90)","v":""}]
[{"$f":"IF('BİLGİ GİRİŞİ'!D91=\"\",\"\",'BİLGİ GİRİŞİ'!D91)","v":""},"",{"$f":"IF('BİLGİ GİRİŞİ'!E91=\"\",\"\",'BİLGİ GİRİŞİ'!E91)","v":""}]
[{"$f":"IF('BİLGİ GİRİŞİ'!D92=\"\",\"\",'BİLGİ GİRİŞİ'!D92)","v":""},"",{"$f":"IF('BİLGİ GİRİŞİ'!E92=\"\",\"\",'BİLGİ GİRİŞİ'!E92)","v":""}]
[{"$f":"IF('BİLGİ GİRİŞİ'!D93=\"\",\"\",'BİLGİ GİRİŞİ'!D93)","v":""},"",{"$f":"IF('BİLGİ GİRİŞİ'!E93=\"\",\"\",'BİLGİ GİRİŞİ'!E93)","v":""}]
[{"$f":"IF('BİLGİ GİRİŞİ'!D94=\"\",\"\",'BİLGİ GİRİŞİ'!D94)","v":""},{"$f":"IF(C17=\"\",\"\",\"-\")","v":""},{"$f":"IF('BİLGİ GİRİŞİ'!E94=\"\",\"\",'BİLGİ GİRİŞİ'!E94)","v":""}]
[{"$f":"IF('BİLGİ GİRİŞİ'!D95=\"\",\"\",'BİLGİ GİRİŞİ'!D95)","v":""},{"$f":"IF(C18=\"\",\"\",\"-\")","v":""},{"$f":"IF('BİLGİ GİRİŞİ'!E95=\"\",\"\",'BİLGİ GİRİŞİ'!E95)","v":""}]
[{"$f":"IF('BİLGİ GİRİŞİ'!D96=\"\",\"\",'BİLGİ GİRİŞİ'!D96)","v":""},{"$f":"IF(C19=\"\",\"\",\"-\")","v":""},{"$f":"IF('BİLGİ GİRİŞİ'!E96=\"\",\"\",'BİLGİ GİRİŞİ'!E96)","v":""}]
[{"$f":"IF('BİLGİ GİRİŞİ'!D97=\"\",\"\",'BİLGİ GİRİŞİ'!D97)","v":""},"",{"$f":"IF('BİLGİ GİRİŞİ'!E97=\"\",\"\",'BİLGİ GİRİŞİ'!E97)","v":""}]
[{"$f":"IF('BİLGİ GİRİŞİ'!D98=\"\",\"\",'BİLGİ GİRİŞİ'!D98)","v":""},"",{"$f":"IF('BİLGİ GİRİŞİ'!E98=\"\",\"\",'BİLGİ GİRİŞİ'!E98)","v":""}]
[{"$f":"IF('BİLGİ GİRİŞİ'!D99=\"\",\"\",'BİLGİ GİRİŞİ'!D99)","v":""},"",{"$f":"IF('BİLGİ GİRİŞİ'!E99=\"\",\"\",'BİLGİ GİRİŞİ'!E99)","v":""}]
[{"$f":"IF('BİLGİ GİRİŞİ'!D100=\"\",\"\",'BİLGİ GİRİŞİ'!D100)","v":""},"",{"$f":"IF('BİLGİ GİRİŞİ'!E100=\"\",\"\",'BİLGİ GİRİŞİ'!E100)","v":""}]
[]
["TEKNİK ŞARTLAR"]
[{"$f":"IF('BİLGİ GİRİŞİ'!D103=\"\",\"\",'BİLGİ GİRİŞİ'!D103)","v":1},{"$f":"IF(C26=\"\",\"\",\"-\")","v":"-"},{"$f":"IF('BİLGİ GİRİŞİ'!E103=\"\",\"\",'BİLGİ GİRİŞİ'!E103)","v":"Bu bent boş bırakılmıştır."}]
[{"$f":"IF('BİLGİ GİRİŞİ'!D104=\"\",\"\",'BİLGİ GİRİŞİ'!D104)","v":""},"",{"$f":"IF('BİLGİ GİRİŞİ'!E104=\"\",\"\",'BİLGİ GİRİŞİ'!E104)","v":""}]
[{"$f":"IF('BİLGİ GİRİŞİ'!D105=\"\",\"\",'BİLGİ GİRİŞİ'!D105)","v":""},"",{"$f":"IF('BİLGİ GİRİŞİ'!E105=\"\",\"\",'BİLGİ GİRİŞİ'!E105)","v":""}]
[{"$f":"IF('BİLGİ GİRİŞİ'!D106=\"\",\"\",'BİLGİ GİRİŞİ'!D106)","v":""},"",{"$f":"IF('BİLGİ GİRİŞİ'!E106=\"\",\"\",'BİLGİ GİRİŞİ'!E106)","v":""}]
[{"$f":"IF('BİLGİ GİRİŞİ'!D107=\"\",\"\",'BİLGİ GİRİŞİ'!D107)","v":""},"",{"$f":"IF('BİLGİ GİRİŞİ'!E107=\"\",\"\",'BİLGİ GİRİŞİ'!E107)","v":""}]
[{"$f":"IF('BİLGİ GİRİŞİ'!D108=\"\",\"\",'BİLGİ GİRİŞİ'!D108)","v":""},"",{"$f":"IF('BİLGİ GİRİŞİ'!E108=\"\",\"\",'BİLGİ GİRİŞİ'!E108)","v":""}]
[{"$f":"IF('BİLGİ GİRİŞİ'!D109=\"\",\"\",'BİLGİ GİRİŞİ'!D109)","v":""},"",{"$f":"IF('BİLGİ GİRİŞİ'!E109=\"\",\"\",'BİLGİ GİRİŞİ'!E109)","v":""}]
[{"$f":"IF('BİLGİ GİRİŞİ'!D110=\"\",\"\",'BİLGİ GİRİŞİ'!D110)","v":""},"",{"$f":"IF('BİLGİ GİRİŞİ'!E110=\"\",\"\",'BİLGİ GİRİŞİ'!E110)","v":""}]
[{"$f":"IF('BİLGİ GİRİŞİ'!D111=\"\",\"\",'BİLGİ GİRİŞİ'!D111)","v":""},"",{"$f":"IF('BİLGİ GİRİŞİ'!E111=\"\",\"\",'BİLGİ GİRİŞİ'!E111)","v":""}]
[{"$f":"IF('BİLGİ GİRİŞİ'!D112=\"\",\"\",'BİLGİ GİRİŞİ'!D112)","v":""},"",{"$f":"IF('BİLGİ GİRİŞİ'!E112=\"\",\"\",'BİLGİ GİRİŞİ'!E112)","v":""}]
[{"$f":"IF('BİLGİ GİRİŞİ'!D113=\"\",\"\",'BİLGİ GİRİŞİ'!D113)","v":""},"",{"$f":"IF('BİLGİ GİRİŞİ'!E113=\"\",\"\",'BİLGİ GİRİŞİ'!E113)","v":""}]
[{"$f":"IF('BİLGİ GİRİŞİ'!D114=\"\",\"\",'BİLGİ GİRİŞİ'!D114)","v":""},"",{"$f":"IF('BİLGİ GİRİŞİ'!E114=\"\",\"\",'BİLGİ GİRİŞİ'!E114)","v":""}]
[{"$f":"IF('BİLGİ GİRİŞİ'!D115=\"\",\"\",'BİLGİ GİRİŞİ'!D115)","v":""},"",{"$f":"IF('BİLGİ GİRİŞİ'!E115=\"\",\"\",'BİLGİ GİRİŞİ'!E115)","v":""}]
[{"$f":"IF('BİLGİ GİRİŞİ'!D116=\"\",\"\",'BİLGİ GİRİŞİ'!D116)","v":""},"",{"$f":"IF('BİLGİ GİRİŞİ'!E116=\"\",\"\",'BİLGİ GİRİŞİ'!E116)","v":""}]
[{"$f":"IF('BİLGİ GİRİŞİ'!D117=\"\",\"\",'BİLGİ GİRİŞİ'!D117)","v":""},"",{"$f":"IF('BİLGİ GİRİŞİ'!E117=\"\",\"\",'BİLGİ GİRİŞİ'!E117)","v":""}]
[{"$f":"IF('BİLGİ GİRİŞİ'!D118=\"\",\"\",'BİLGİ GİRİŞİ'!D118)","v":""},"",{"$f":"IF('BİLGİ GİRİŞİ'!E118=\"\",\"\",'BİLGİ GİRİŞİ'!E118)","v":""}]
[{"$f":"IF('BİLGİ GİRİŞİ'!D119=\"\",\"\",'BİLGİ GİRİŞİ'!D119)","v":""},"",{"$f":"IF('BİLGİ GİRİŞİ'!E119=\"\",\"\",'BİLGİ GİRİŞİ'!E119)","v":""}]
[{"$f":"IF('BİLGİ GİRİŞİ'!D120=\"\",\"\",'BİLGİ GİRİŞİ'!D120)","v":""},"",{"$f":"IF('BİLGİ GİRİŞİ'!E120=\"\",\"\",'BİLGİ GİRİŞİ'!E120)","v":""}]
[{"$f":"IF('BİLGİ GİRİŞİ'!D121=\"\",\"\",'BİLGİ GİRİŞİ'!D121)","v":""},"",{"$f":"IF('BİLGİ GİRİŞİ'!E121=\"\",\"\",'BİLGİ GİRİŞİ'!E121)","v":""}]
[{"$f":"IF('BİLGİ GİRİŞİ'!D122=\"\",\"\",'BİLGİ GİRİŞİ'!D122)","v":""},"",{"$f":"IF('BİLGİ GİRİŞİ'!E122=\"\",\"\",'BİLGİ GİRİŞİ'!E122)","v":""}]

{"sheet":"7","index":8,"n_rows":47,"n_cols":44,"rows_kept":47,"cut":false,"hidden":false,"merged":[[42,0,42,14],[45,0,45,14],[46,0,46,14],[42,15,42,30],[45,15,45,30],[46,15,46,30],[41,31,42,46],[45,31,45,46],[46,31,46,46],[6,0,6,9],[6,11,6,14],[6,16,6,46],[8,0,8,22],[8,23,8,46],[1,0,1,46],[3,0,3,9],[3,11,3,41],[3,42,3,46],[4,0,4,9],[4,11,4,46],[5,0,5,9],[5,11,5,46],[9,31,9,38],[9,39,9,46],[10,23,10,26],[10,27,10,30],[10,31,10,34],[10,35,10,38],[10,39,10,42],[10,43,10,46],[9,0,10,0],[9,1,10,14],[9,23,9,30],[9,15,10,18],[9,19,10,22],[11,31,11,34],[11,35,11,38],[11,39,11,42],[11,43,11,46],[12,1,12,14],[12,23,12,26],[12,27,12,30],[11,1,11,14],[11,23,11,26],[11,27,11,30],[12,31,12,34],[12,35,12,38],[12,39,12,42],[12,43,12,46],[11,15,11,18],[11,19,11,22],[12,15,12,18],[12,19,12,22],[13,43,13,46],[14,1,14,14],[14,23,14,26],[14,27,14,30],[14,31,14,34],[14,35,14,38],[14,39,14,42],[14,43,14,46],[13,1,13,14],[13,23,13,26],[13,27,13,30],[13,31,13,34],[13,35,13,38],[13,39,13,42],[13,15,13,18],[14,15,14,18],[13,19,13,22],[14,19,14,22],[15,43,15,46],[16,1,16,14],[16,23,16,26],[16,27,16,30],[16,31,16,34],[16,35,16,38],[16,39,16,42],[16,43,16,46],[15,1,15,14],[15,23,15,26],[15,27,15,30],[15,31,15,34],[15,35,15,38],[15,39,15,42],[15,15,15,18],[16,15,16,18],[15,19,15,22],[16,19,16,22],[17,43,17,46],[18,1,18,14],[18,23,18,26],[18,27,18,30],[18,31,18,34],[18,35,18,38],[18,39,18,42],[18,43,18,46],[17,1,17,14],[17,23,17,26],[17,27,17,30],[17,31,17,34],[17,35,17,38],[17,39,17,42],[17,15,17,18],[18,15,18,18],[17,19,17,22],[18,19,18,22],[19,43,19,46],[20,1,20,14],[20,23,20,26],[20,27,20,30],[20,31,20,34],[20,35,20,38],[20,39,20,42],[20,43,20,46],[19,1,19,14],[19,23,19,26],[19,27,19,30],[19,31,19,34],[19,35,19,38],[19,39,19,42],[19,15,19,18],[20,15,20,18],[19,19,19,22],[20,19,20,22],[21,43,21,46],[22,1,22,14],[22,23,22,26],[22,27,22,30],[22,31,22,34],[22,35,22,38],[22,39,22,42],[22,43,22,46],[21,1,21,14],[21,23,21,26],[21,27,21,30],[21,31,21,34],[21,35,21,38],[21,39,21,42],[21,15,21,18],[22,15,22,18],[21,19,21,22],[22,19,22,22],[23,43,23,46],[24,1,24,14],[24,23,24,26],[24,27,24,30],[24,31,24,34],[24,35,24,38],[24,39,24,42],[24,43,24,46],[23,1,23,14],[23,23,23,26],[23,27,23,30],[23,31,23,34],[23,35,23,38],[23,39,23,42],[23,15,23,18],[24,15,24,18],[23,19,23,22],[24,19,24,22],[25,43,25,46],[26,1,26,14],[26,23,26,26],[26,27,26,30],[26,31,26,34],[26,35,26,38],[26,39,26,42],[26,43,26,46],[25,1,25,14],[25,23,25,26],[25,27,25,30],[25,31,25,34],[25,35,25,38],[25,39,25,42],[25,15,25,18],[26,15,26,18],[25,19,25,22],[26,19,26,22],[27,43,27,46],[28,1,28,14],[28,23,28,26],[28,27,28,30],[28,31,28,34],[28,35,28,38],[28,39,28,42],[28,43,28,46],[27,1,27,14],[27,23,27,26],[27,27,27,30],[27,31,27,34],[27,35,27,38],[27,39,27,42],[27,15,27,18],[28,15,28,18],[27,19,27,22],[28,19,28,22],[29,43,29,46],[30,1,30,14],[30,23,30,26],[30,27,30,30],[30,31,30,34],[30,35,30,38],[30,39,30,42],[30,43,30,46],[29,1,29,14],[29,23,29,26],[29,27,29,30],[29,31,29,34],[29,35,29,38],[29,39,29,42],[29,15,29,18],[30,15,30,18],[29,19,29,22],[30,19,30,22],[37,0,39,46],[35,39,35,46],[35,23,35,38],[35,0,35,22],[31,0,31,22],[31,23,31,26],[31,27,31,30],[31,31,31,34],[31,35,31,38],[31,39,31,42],[31,43,31,46],[33,0,33,46],[34,39,34,46],[34,23,34,38],[34,0,34,22]]}
[]
["PİYASA FİYAT ARAŞTIRMA TUTANAĞI"]
[]
["İdarenin Adı",null,null,null,null,null,null,null,null,null,":",{"$f":"IF('BİLGİ GİRİŞİ'!O8=\"\",\"\",'BİLGİ GİRİŞİ'!O8)","v":"Atatürk İlkokulu Müdürlüğü"},null,null,null,null,null,null,null,null,null,null,null,null,null,null,null,null,null,null,null,null,null,null,null,null,null,null,null,null,null,null,{"$f":"IF('BİLGİ GİRİŞİ'!O22=\"\",\"…../…../……..\",'BİLGİ GİRİŞİ'!O22)","v":"2023-03-08"}]
["Doğrudan Temin Numarası",null,null,null,null,null,null,null,null,null,":",{"$f":"IF('BİLGİ GİRİŞİ'!O11=\"\",\"\",'BİLGİ GİRİŞİ'!O11)","v":"22DT1211930"}]
["İş'in Adı, Türü",null,null,null,null,null,null,null,null,null,":",{"$f":"IF('BİLGİ GİRİŞİ'!O9=\"\",\"\",'BİLGİ GİRİŞİ'!O9)","v":"Bilişim Malzemeleri Alımı"}]
["Alım/Görevlendirme Onay Tarihi/sayısı",null,null,null,null,null,null,null,null,null,":",{"$f":"IF('BİLGİ GİRİŞİ'!O15=\"\",\"\",'BİLGİ GİRİŞİ'!O15)","v":"2023-03-06"},null,null,null,"/",{"$f":"IF('BİLGİ GİRİŞİ'!S15=\"\",\"\",'BİLGİ GİRİŞİ'!S15)","v":456789123}]
[]
["MAL'IN/HİZMET'İN/YAPIM İŞİ'NİN",null,null,null,null,null,null,null,null,null,null,null,null,null,null,null,null,null,null,null,null,null,null,"TEKLİF VEREN GERÇEK/TÜZEL KİŞİLER VE TEKLİF FİYATLARI"]
["S","Kalem/KısımBilgileri",null,null,null,null,null,null,null,null,null,null,null,null,null,"Birimi",null,null,null,"Miktarı",null,null,null,{"$f":"IF('BİLGİ GİRİŞİ'!AB55=\"\",\"\",'BİLGİ GİRİŞİ'!AB55)","v":"A GERÇEK/TÜZEL KİŞİSİ"},null,null,null,null,null,null,null,{"$f":"IF('BİLGİ GİRİŞİ'!AJ55=\"\",\"\",'BİLGİ GİRİŞİ'!AJ55)","v":"B GERÇEK/TÜZEL KİŞİSİ"},null,null,null,null,null,null,null,{"$f":"IF('BİLGİ GİRİŞİ'!AR55=\"\",\"\",'BİLGİ GİRİŞİ'!AR55)","v":"D GERÇEK/TÜZEL KİŞİSİ"}]
[null,null,null,null,null,null,null,null,null,null,null,null,null,null,null,null,null,null,null,null,null,null,null,"Birim Fiyat",null,null,null,"Toplam Fiyat",null,null,null,"Birim Fiyat",null,null,null,"Toplam Fiyat",null,null,null,"Birim Fiyat",null,null,null,"Toplam Fiyat"]
[{"$f":"IF('BİLGİ GİRİŞİ'!D30=\"\",\"\",'BİLGİ GİRİŞİ'!D30)","v":1},{"$f":"IF('BİLGİ GİRİŞİ'!E30=\"\",\"\",'BİLGİ GİRİŞİ'!E30)","v":"AIO (All In One) Masaüstü Bilgisayar "},null,null,null,null,null,null,null,null,null,null,null,null,null,{"$f":"IF('BİLGİ GİRİŞİ'!W30=\"\",\"\",'BİLGİ GİRİŞİ'!W30)","v":"Adet"},null,null,null,{"$f":"IF('BİLGİ GİRİŞİ'!T30=\"\",\"\",'BİLGİ GİRİŞİ'!T30)","v":20},null,null,null,{"$f":"IF('BİLGİ GİRİŞİ'!AB57=\"\",\"\",'BİLGİ GİRİŞİ'!AB57)","v":13000},null,null,null,{"$f":"IF('BİLGİ GİRİŞİ'!AF57=\"\",\"\",'BİLGİ GİRİŞİ'!AF57)","v":260000},null,null,null,{"$f":"IF('BİLGİ GİRİŞİ'!AJ57=\"\",\"\",'BİLGİ GİRİŞİ'!AJ57)","v":11000},null,null,null,{"$f":"IF('BİLGİ GİRİŞİ'!AN57=\"\",\"\",'BİLGİ GİRİŞİ'!AN57)","v":220000},null,null,null,{"$f":"IF('BİLGİ GİRİŞİ'!AR57=\"\",\"\",'BİLGİ GİRİŞİ'!AR57)","v":12000},null,null,null,{"$f":"IF('BİLGİ GİRİŞİ'!AV57=\"\",\"\",'BİLGİ GİRİŞİ'!AV57)","v":240000}]
[{"$f":"IF('BİLGİ GİRİŞİ'!D31=\"\",\"\",'BİLGİ GİRİŞİ'!D31)","v":2},{"$f":"IF('BİLGİ GİRİŞİ'!E31=\"\",\"\",'BİLGİ GİRİŞİ'!E31)","v":"Fotokopi Makinesi"},null,null,null,null,null,null,null,null,null,null,null,null,null,{"$f":"IF('BİLGİ GİRİŞİ'!W31=\"\",\"\",'BİLGİ GİRİŞİ'!W31)","v":"Adet"},null,null,null,{"$f":"IF('BİLGİ GİRİŞİ'!T31=\"\",\"\",'BİLGİ GİRİŞİ'!T31)","v":10},null,null,null,{"$f":"IF('BİLGİ GİRİŞİ'!AB58=\"\",\"\",'BİLGİ GİRİŞİ'!AB58)","v":10000},null,null,null,{"$f":"IF('BİLGİ GİRİŞİ'!AF58=\"\",\"\",'BİLGİ GİRİŞİ'!AF58)","v":100000},null,null,null,{"$f":"IF('BİLGİ GİRİŞİ'!AJ58=\"\",\"\",'BİLGİ GİRİŞİ'!AJ58)","v":9000},null,null,null,{"$f":"IF('BİLGİ GİRİŞİ'!AN58=\"\",\"\",'BİLGİ GİRİŞİ'!AN58)","v":90000},null,null,null,{"$f":"IF('BİLGİ GİRİŞİ'!AR58=\"\",\"\",'BİLGİ GİRİŞİ'!AR58)","v":9000},null,null,null,{"$f":"IF('BİLGİ GİRİŞİ'!AV58=\"\",\"\",'BİLGİ GİRİŞİ'!AV58)","v":90000}]
[{"$f":"IF('BİLGİ GİRİŞİ'!D32=\"\",\"\",'BİLGİ GİRİŞİ'!D32)","v":3},{"$f":"IF('BİLGİ GİRİŞİ'!E32=\"\",\"\",'BİLGİ GİRİŞİ'!E32)","v":"Projektör"},null,null,null,null,null,null,null,null,null,null,null,null,null,{"$f":"IF('BİLGİ GİRİŞİ'!W32=\"\",\"\",'BİLGİ GİRİŞİ'!W32)","v":"Adet"},null,null,null,{"$f":"IF('BİLGİ GİRİŞİ'!T32=\"\",\"\",'BİLGİ GİRİŞİ'!T32)","v":4},null,null,null,{"$f":"IF('BİLGİ GİRİŞİ'!AB59=\"\",\"\",'BİLGİ GİRİŞİ'!AB59)","v":7000},null,null,null,{"$f":"IF('BİLGİ GİRİŞİ'!AF59=\"\",\"\",'BİLGİ GİRİŞİ'!AF59)","v":28000},null,null,null,{"$f":"IF('BİLGİ GİRİŞİ'!AJ59=\"\",\"\",'BİLGİ GİRİŞİ'!AJ59)","v":6000},null,null,null,{"$f":"IF('BİLGİ GİRİŞİ'!AN59=\"\",\"\",'BİLGİ GİRİŞİ'!AN59)","v":24000},null,null,null,{"$f":"IF('BİLGİ GİRİŞİ'!AR59=\"\",\"\",'BİLGİ GİRİŞİ'!AR59)","v":7000},null,null,null,{"$f":"IF('BİLGİ GİRİŞİ'!AV59=\"\",\"\",'BİLGİ GİRİŞİ'!AV59)","v":28000}]
[{"$f":"IF('BİLGİ GİRİŞİ'!D33=\"\",\"\",'BİLGİ GİRİŞİ'!D33)","v":""},{"$f":"IF('BİLGİ GİRİŞİ'!E33=\"\",\"\",'BİLGİ GİRİŞİ'!E33)","v":""},null,null,null,null,null,null,null,null,null,null,null,null,null,{"$f":"IF('BİLGİ GİRİŞİ'!W33=\"\",\"\",'BİLGİ GİRİŞİ'!W33)","v":""},null,null,null,{"$f":"IF('BİLGİ GİRİŞİ'!T33=\"\",\"\",'BİLGİ GİRİŞİ'!T33)","v":""},null,null,null,{"$f":"IF('BİLGİ GİRİŞİ'!AB60=\"\",\"\",'BİLGİ GİRİŞİ'!AB60)","v":""},null,null,null,{"$f":"IF('BİLGİ GİRİŞİ'!AF60=\"\",\"\",'BİLGİ GİRİŞİ'!AF60)","v":""},null,null,null,{"$f":"IF('BİLGİ GİRİŞİ'!AJ60=\"\",\"\",'BİLGİ GİRİŞİ'!AJ60)","v":""},null,null,null,{"$f":"IF('BİLGİ GİRİŞİ'!AN60=\"\",\"\",'BİLGİ GİRİŞİ'!AN60)","v":""},null,null,null,{"$f":"IF('BİLGİ GİRİŞİ'!AR60=\"\",\"\",'BİLGİ GİRİŞİ'!AR60)","v":""},null,null,null,{"$f":"IF('BİLGİ GİRİŞİ'!AV60=\"\",\"\",'BİLGİ GİRİŞİ'!AV60)","v":""}]
[{"$f":"IF('BİLGİ GİRİŞİ'!D34=\"\",\"\",'BİLGİ GİRİŞİ'!D34)","v":""},{"$f":"IF('BİLGİ GİRİŞİ'!E34=\"\",\"\",'BİLGİ GİRİŞİ'!E34)","v":""},null,null,null,null,null,null,null,null,null,null,null,null,null,{"$f":"IF('BİLGİ GİRİŞİ'!W34=\"\",\"\",'BİLGİ GİRİŞİ'!W34)","v":""},null,null,null,{"$f":"IF('BİLGİ GİRİŞİ'!T34=\"\",\"\",'BİLGİ GİRİŞİ'!T34)","v":""},null,null,null,{"$f":"IF('BİLGİ GİRİŞİ'!AB61=\"\",\"\",'BİLGİ GİRİŞİ'!AB61)","v":""},null,null,null,{"$f":"IF('BİLGİ GİRİŞİ'!AF61=\"\",\"\",'BİLGİ GİRİŞİ'!AF61)","v":""},null,null,null,{"$f":"IF('BİLGİ GİRİŞİ'!AJ61=\"\",\"\",'BİLGİ GİRİŞİ'!AJ61)","v":""},null,null,null,{"$f":"IF('BİLGİ GİRİŞİ'!AN61=\"\",\"\",'BİLGİ GİRİŞİ'!AN61)","v":""},null,null,null,{"$f":"IF('BİLGİ GİRİŞİ'!AR61=\"\",\"\",'BİLGİ GİRİŞİ'!AR61)","v":""},null,null,null,{"$f":"IF('BİLGİ GİRİŞİ'!AV61=\"\",\"\",'BİLGİ GİRİŞİ'!AV61)","v":""}]
[{"$f":"IF('BİLGİ GİRİŞİ'!D35=\"\",\"\",'BİLGİ GİRİŞİ'!D35)","v":""},{"$f":"IF('BİLGİ GİRİŞİ'!E35=\"\",\"\",'BİLGİ GİRİŞİ'!E35)","v":""},null,null,null,null,null,null,null,null,null,null,null,null,null,{"$f":"IF('BİLGİ GİRİŞİ'!W35=\"\",\"\",'BİLGİ GİRİŞİ'!W35)","v":""},null,null,null,{"$f":"IF('BİLGİ GİRİŞİ'!T35=\"\",\"\",'BİLGİ GİRİŞİ'!T35)","v":""},null,null,null,{"$f":"IF('BİLGİ GİRİŞİ'!AB62=\"\",\"\",'BİLGİ GİRİŞİ'!AB62)","v":""},null,null,null,{"$f":"IF('BİLGİ GİRİŞİ'!AF62=\"\",\"\",'BİLGİ GİRİŞİ'!AF62)","v":""},null,null,null,{"$f":"IF('BİLGİ GİRİŞİ'!AJ62=\"\",\"\",'BİLGİ GİRİŞİ'!AJ62)","v":""},null,null,null,{"$f":"IF('BİLGİ GİRİŞİ'!AN62=\"\",\"\",'BİLGİ GİRİŞİ'!AN62)","v":""},null,null,null,{"$f":"IF('BİLGİ GİRİŞİ'!AR62=\"\",\"\",'BİLGİ GİRİŞİ'!AR62)","v":""},null,null,null,{"$f":"IF('BİLGİ GİRİŞİ'!AV62=\"\",\"\",'BİLGİ GİRİŞİ'!AV62)","v":""}]
[{"$f":"IF('BİLGİ GİRİŞİ'!D36=\"\",\"\",'BİLGİ GİRİŞİ'!D36)","v":""},{"$f":"IF('BİLGİ GİRİŞİ'!E36=\"\",\"\",'BİLGİ GİRİŞİ'!E36)","v":""},null,null,null,null,null,null,null,null,null,null,null,null,null,{"$f":"IF('BİLGİ GİRİŞİ'!W36=\"\",\"\",'BİLGİ GİRİŞİ'!W36)","v":""},null,null,null,{"$f":"IF('BİLGİ GİRİŞİ'!T36=\"\",\"\",'BİLGİ GİRİŞİ'!T36)","v":""},null,null,null,{"$f":"IF('BİLGİ GİRİŞİ'!AB63=\"\",\"\",'BİLGİ GİRİŞİ'!AB63)","v":""},null,null,null,{"$f":"IF('BİLGİ GİRİŞİ'!AF63=\"\",\"\",'BİLGİ GİRİŞİ'!AF63)","v":""},null,null,null,{"$f":"IF('BİLGİ GİRİŞİ'!AJ63=\"\",\"\",'BİLGİ GİRİŞİ'!AJ63)","v":""},null,null,null,{"$f":"IF('BİLGİ GİRİŞİ'!AN63=\"\",\"\",'BİLGİ GİRİŞİ'!AN63)","v":""},null,null,null,{"$f":"IF('BİLGİ GİRİŞİ'!AR63=\"\",\"\",'BİLGİ GİRİŞİ'!AR63)","v":""},null,null,null,{"$f":"IF('BİLGİ GİRİŞİ'!AV63=\"\",\"\",'BİLGİ GİRİŞİ'!AV63)","v":""}]
[{"$f":"IF('BİLGİ GİRİŞİ'!D37=\"\",\"\",'BİLGİ GİRİŞİ'!D37)","v":""},{"$f":"IF('BİLGİ GİRİŞİ'!E37=\"\",\"\",'BİLGİ GİRİŞİ'!E37)","v":""},null,null,null,null,null,null,null,null,null,null,null,null,null,{"$f":"IF('BİLGİ GİRİŞİ'!W37=\"\",\"\",'BİLGİ GİRİŞİ'!W37)","v":""},null,null,null,{"$f":"IF('BİLGİ GİRİŞİ'!T37=\"\",\"\",'BİLGİ GİRİŞİ'!T37)","v":""},null,null,null,{"$f":"IF('BİLGİ GİRİŞİ'!AB64=\"\",\"\",'BİLGİ GİRİŞİ'!AB64)","v":""},null,null,null,{"$f":"IF('BİLGİ GİRİŞİ'!AF64=\"\",\"\",'BİLGİ GİRİŞİ'!AF64)","v":""},null,null,null,{"$f":"IF('BİLGİ GİRİŞİ'!AJ64=\"\",\"\",'BİLGİ GİRİŞİ'!AJ64)","v":""},null,null,null,{"$f":"IF('BİLGİ GİRİŞİ'!AN64=\"\",\"\",'BİLGİ GİRİŞİ'!AN64)","v":""},null,null,null,{"$f":"IF('BİLGİ GİRİŞİ'!AR64=\"\",\"\",'BİLGİ GİRİŞİ'!AR64)","v":""},null,null,null,{"$f":"IF('BİLGİ GİRİŞİ'!AV64=\"\",\"\",'BİLGİ GİRİŞİ'!AV64)","v":""}]
[{"$f":"IF('BİLGİ GİRİŞİ'!D38=\"\",\"\",'BİLGİ GİRİŞİ'!D38)","v":""},{"$f":"IF('BİLGİ GİRİŞİ'!E38=\"\",\"\",'BİLGİ GİRİŞİ'!E38)","v":""},null,null,null,null,null,null,null,null,null,null,null,null,null,{"$f":"IF('BİLGİ GİRİŞİ'!W38=\"\",\"\",'BİLGİ GİRİŞİ'!W38)","v":""},null,null,null,{"$f":"IF('BİLGİ GİRİŞİ'!T38=\"\",\"\",'BİLGİ GİRİŞİ'!T38)","v":""},null,null,null,{"$f":"IF('BİLGİ GİRİŞİ'!AB65=\"\",\"\",'BİLGİ GİRİŞİ'!AB65)","v":""},null,null,null,{"$f":"IF('BİLGİ GİRİŞİ'!AF65=\"\",\"\",'BİLGİ GİRİŞİ'!AF65)","v":""},null,null,null,{"$f":"IF('BİLGİ GİRİŞİ'!AJ65=\"\",\"\",'BİLGİ GİRİŞİ'!AJ65)","v":""},null,null,null,{"$f":"IF('BİLGİ GİRİŞİ'!AN65=\"\",\"\",'BİLGİ GİRİŞİ'!AN65)","v":""},null,null,null,{"$f":"IF('BİLGİ GİRİŞİ'!AR65=\"\",\"\",'BİLGİ GİRİŞİ'!AR65)","v":""},null,null,null,{"$f":"IF('BİLGİ GİRİŞİ'!AV65=\"\",\"\",'BİLGİ GİRİŞİ'!AV65)","v":""}]
[{"$f":"IF('BİLGİ GİRİŞİ'!D39=\"\",\"\",'BİLGİ GİRİŞİ'!D39)","v":""},{"$f":"IF('BİLGİ GİRİŞİ'!E39=\"\",\"\",'BİLGİ GİRİŞİ'!E39)","v":""},null,null,null,null,null,null,null,null,null,null,null,null,null,{"$f":"IF('BİLGİ GİRİŞİ'!W39=\"\",\"\",'BİLGİ GİRİŞİ'!W39)","v":""},null,null,null,{"$f":"IF('BİLGİ GİRİŞİ'!T39=\"\",\"\",'BİLGİ GİRİŞİ'!T39)","v":""},null,null,null,{"$f":"IF('BİLGİ GİRİŞİ'!AB66=\"\",\"\",'BİLGİ GİRİŞİ'!AB66)","v":""},null,null,null,{"$f":"IF('BİLGİ GİRİŞİ'!AF66=\"\",\"\",'BİLGİ GİRİŞİ'!AF66)","v":""},null,null,null,{"$f":"IF('BİLGİ GİRİŞİ'!AJ66=\"\",\"\",'BİLGİ GİRİŞİ'!AJ66)","v":""},null,null,null,{"$f":"IF('BİLGİ GİRİŞİ'!AN66=\"\",\"\",'BİLGİ GİRİŞİ'!AN66)","v":""},null,null,null,{"$f":"IF('BİLGİ GİRİŞİ'!AR66=\"\",\"\",'BİLGİ GİRİŞİ'!AR66)","v":""},null,null,null,{"$f":"IF('BİLGİ GİRİŞİ'!AV66=\"\",\"\",'BİLGİ GİRİŞİ'!AV66)","v":""}]
[{"$f":"IF('BİLGİ GİRİŞİ'!D40=\"\",\"\",'BİLGİ GİRİŞİ'!D40)","v":""},{"$f":"IF('BİLGİ GİRİŞİ'!E40=\"\",\"\",'BİLGİ GİRİŞİ'!E40)","v":""},null,null,null,null,null,null,null,null,null,null,null,null,null,{"$f":"IF('BİLGİ GİRİŞİ'!W40=\"\",\"\",'BİLGİ GİRİŞİ'!W40)","v":""},null,null,null,{"$f":"IF('BİLGİ GİRİŞİ'!T40=\"\",\"\",'BİLGİ GİRİŞİ'!T40)","v":""},null,null,null,{"$f":"IF('BİLGİ GİRİŞİ'!AB67=\"\",\"\",'BİLGİ GİRİŞİ'!AB67)","v":""},null,null,null,{"$f":"IF('BİLGİ GİRİŞİ'!AF67=\"\",\"\",'BİLGİ GİRİŞİ'!AF67)","v":""},null,null,null,{"$f":"IF('BİLGİ GİRİŞİ'!AJ67=\"\",\"\",'BİLGİ GİRİŞİ'!AJ67)","v":""},null,null,null,{"$f":"IF('BİLGİ GİRİŞİ'!AN67=\"\",\"\",'BİLGİ GİRİŞİ'!AN67)","v":""},null,null,null,{"$f":"IF('BİLGİ GİRİŞİ'!AR67=\"\",\"\",'BİLGİ GİRİŞİ'!AR67)","v":""},null,null,null,{"$f":"IF('BİLGİ GİRİŞİ'!AV67=\"\",\"\",'BİLGİ GİRİŞİ'!AV67)","v":""}]
[{"$f":"IF('BİLGİ GİRİŞİ'!D41=\"\",\"\",'BİLGİ GİRİŞİ'!D41)","v":""},{"$f":"IF('BİLGİ GİRİŞİ'!E41=\"\",\"\",'BİLGİ GİRİŞİ'!E41)","v":""},null,null,null,null,null,null,null,null,null,null,null,null,null,{"$f":"IF('BİLGİ GİRİŞİ'!W41=\"\",\"\",'BİLGİ GİRİŞİ'!W41)","v":""},null,null,null,{"$f":"IF('BİLGİ GİRİŞİ'!T41=\"\",\"\",'BİLGİ GİRİŞİ'!T41)","v":""},null,null,null,{"$f":"IF('BİLGİ GİRİŞİ'!AB68=\"\",\"\",'BİLGİ GİRİŞİ'!AB68)","v":""},null,null,null,{"$f":"IF('BİLGİ GİRİŞİ'!AF68=\"\",\"\",'BİLGİ GİRİŞİ'!AF68)","v":""},null,null,null,{"$f":"IF('BİLGİ GİRİŞİ'!AJ68=\"\",\"\",'BİLGİ GİRİŞİ'!AJ68)","v":""},null,null,null,{"$f":"IF('BİLGİ GİRİŞİ'!AN68=\"\",\"\",'BİLGİ GİRİŞİ'!AN68)","v":""},null,null,null,{"$f":"IF('BİLGİ GİRİŞİ'!AR68=\"\",\"\",'BİLGİ GİRİŞİ'!AR68)","v":""},null,null,null,{"$f":"IF('BİLGİ GİRİŞİ'!AV68=\"\",\"\",'BİLGİ GİRİŞİ'!AV68)","v":""}]
[{"$f":"IF('BİLGİ GİRİŞİ'!D42=\"\",\"\",'BİLGİ GİRİŞİ'!D42)","v":""},{"$f":"IF('BİLGİ GİRİŞİ'!E42=\"\",\"\",'BİLGİ GİRİŞİ'!E42)","v":""},null,null,null,null,null,null,null,null,null,null,null,null,null,{"$f":"IF('BİLGİ GİRİŞİ'!W42=\"\",\"\",'BİLGİ GİRİŞİ'!W42)","v":""},null,null,null,{"$f":"IF('BİLGİ GİRİŞİ'!T42=\"\",\"\",'BİLGİ GİRİŞİ'!T42)","v":""},null,null,null,{"$f":"IF('BİLGİ GİRİŞİ'!AB69=\"\",\"\",'BİLGİ GİRİŞİ'!AB69)","v":""},null,null,null,{"$f":"IF('BİLGİ GİRİŞİ'!AF69=\"\",\"\",'BİLGİ GİRİŞİ'!AF69)","v":""},null,null,null,{"$f":"IF('BİLGİ GİRİŞİ'!AJ69=\"\",\"\",'BİLGİ GİRİŞİ'!AJ69)","v":""},null,null,null,{"$f":"IF('BİLGİ GİRİŞİ'!AN69=\"\",\"\",'BİLGİ GİRİŞİ'!AN69)","v":""},null,null,null,{"$f":"IF('BİLGİ GİRİŞİ'!AR69=\"\",\"\",'BİLGİ GİRİŞİ'!AR69)","v":""},null,null,null,{"$f":"IF('BİLGİ GİRİŞİ'!AV69=\"\",\"\",'BİLGİ GİRİŞİ'!AV69)","v":""}]
[{"$f":"IF('BİLGİ GİRİŞİ'!D43=\"\",\"\",'BİLGİ GİRİŞİ'!D43)","v":""},{"$f":"IF('BİLGİ GİRİŞİ'!E43=\"\",\"\",'BİLGİ GİRİŞİ'!E43)","v":""},null,null,null,null,null,null,null,null,null,null,null,null,null,{"$f":"IF('BİLGİ GİRİŞİ'!W43=\"\",\"\",'BİLGİ GİRİŞİ'!W43)","v":""},null,null,null,{"$f":"IF('BİLGİ GİRİŞİ'!T43=\"\",\"\",'BİLGİ GİRİŞİ'!T43)","v":""},null,null,null,{"$f":"IF('BİLGİ GİRİŞİ'!AB70=\"\",\"\",'BİLGİ GİRİŞİ'!AB70)","v":""},null,null,null,{"$f":"IF('BİLGİ GİRİŞİ'!AF70=\"\",\"\",'BİLGİ GİRİŞİ'!AF70)","v":""},null,null,null,{"$f":"IF('BİLGİ GİRİŞİ'!AJ70=\"\",\"\",'BİLGİ GİRİŞİ'!AJ70)","v":""},null,null,null,{"$f":"IF('BİLGİ GİRİŞİ'!AN70=\"\",\"\",'BİLGİ GİRİŞİ'!AN70)","v":""},null,null,null,{"$f":"IF('BİLGİ GİRİŞİ'!AR70=\"\",\"\",'BİLGİ GİRİŞİ'!AR70)","v":""},null,null,null,{"$f":"IF('BİLGİ GİRİŞİ'!AV70=\"\",\"\",'BİLGİ GİRİŞİ'!AV70)","v":""}]
[{"$f":"IF('BİLGİ GİRİŞİ'!D44=\"\",\"\",'BİLGİ GİRİŞİ'!D44)","v":""},{"$f":"IF('BİLGİ GİRİŞİ'!E44=\"\",\"\",'BİLGİ GİRİŞİ'!E44)","v":""},null,null,null,null,null,null,null,null,null,null,null,null,null,{"$f":"IF('BİLGİ GİRİŞİ'!W44=\"\",\"\",'BİLGİ GİRİŞİ'!W44)","v":""},null,null,null,{"$f":"IF('BİLGİ GİRİŞİ'!T44=\"\",\"\",'BİLGİ GİRİŞİ'!T44)","v":""},null,null,null,{"$f":"IF('BİLGİ GİRİŞİ'!AB71=\"\",\"\",'BİLGİ GİRİŞİ'!AB71)","v":""},null,null,null,{"$f":"IF('BİLGİ GİRİŞİ'!AF71=\"\",\"\",'BİLGİ GİRİŞİ'!AF71)","v":""},null,null,null,{"$f":"IF('BİLGİ GİRİŞİ'!AJ71=\"\",\"\",'BİLGİ GİRİŞİ'!AJ71)","v":""},null,null,null,{"$f":"IF('BİLGİ GİRİŞİ'!AN71=\"\",\"\",'BİLGİ GİRİŞİ'!AN71)","v":""},null,null,null,{"$f":"IF('BİLGİ GİRİŞİ'!AR71=\"\",\"\",'BİLGİ GİRİŞİ'!AR71)","v":""},null,null,null,{"$f":"IF('BİLGİ GİRİŞİ'!AV71=\"\",\"\",'BİLGİ GİRİŞİ'!AV71)","v":""}]
[{"$f":"IF('BİLGİ GİRİŞİ'!D45=\"\",\"\",'BİLGİ GİRİŞİ'!D45)","v":""},{"$f":"IF('BİLGİ GİRİŞİ'!E45=\"\",\"\",'BİLGİ GİRİŞİ'!E45)","v":""},null,null,null,null,null,null,null,null,null,null,null,null,null,{"$f":"IF('BİLGİ GİRİŞİ'!W45=\"\",\"\",'BİLGİ GİRİŞİ'!W45)","v":""},null,null,null,{"$f":"IF('BİLGİ GİRİŞİ'!T45=\"\",\"\",'BİLGİ GİRİŞİ'!T45)","v":""},null,null,null,{"$f":"IF('BİLGİ GİRİŞİ'!AB72=\"\",\"\",'BİLGİ GİRİŞİ'!AB72)","v":""},null,null,null,{"$f":"IF('BİLGİ GİRİŞİ'!AF72=\"\",\"\",'BİLGİ GİRİŞİ'!AF72)","v":""},null,null,null,{"$f":"IF('BİLGİ GİRİŞİ'!AJ72=\"\",\"\",'BİLGİ GİRİŞİ'!AJ72)","v":""},null,null,null,{"$f":"IF('BİLGİ GİRİŞİ'!AN72=\"\",\"\",'BİLGİ GİRİŞİ'!AN72)","v":""},null,null,null,{"$f":"IF('BİLGİ GİRİŞİ'!AR72=\"\",\"\",'BİLGİ GİRİŞİ'!AR72)","v":""},null,null,null,{"$f":"IF('BİLGİ GİRİŞİ'!AV72=\"\",\"\",'BİLGİ GİRİŞİ'!AV72)","v":""}]
[{"$f":"IF('BİLGİ GİRİŞİ'!D46=\"\",\"\",'BİLGİ GİRİŞİ'!D46)","v":""},{"$f":"IF('BİLGİ GİRİŞİ'!E46=\"\",\"\",'BİLGİ GİRİŞİ'!E46)","v":""},null,null,null,null,null,null,null,null,null,null,null,null,null,{"$f":"IF('BİLGİ GİRİŞİ'!W46=\"\",\"\",'BİLGİ GİRİŞİ'!W46)","v":""},null,null,null,{"$f":"IF('BİLGİ GİRİŞİ'!T46=\"\",\"\",'BİLGİ GİRİŞİ'!T46)","v":""},null,null,null,{"$f":"IF('BİLGİ GİRİŞİ'!AB73=\"\",\"\",'BİLGİ GİRİŞİ'!AB73)","v":""},null,null,null,{"$f":"IF('BİLGİ GİRİŞİ'!AF73=\"\",\"\",'BİLGİ GİRİŞİ'!AF73)","v":""},null,null,null,{"$f":"IF('BİLGİ GİRİŞİ'!AJ73=\"\",\"\",'BİLGİ GİRİŞİ'!AJ73)","v":""},null,null,null,{"$f":"IF('BİLGİ GİRİŞİ'!AN73=\"\",\"\",'BİLGİ GİRİŞİ'!AN73)","v":""},null,null,null,{"$f":"IF('BİLGİ GİRİŞİ'!AR73=\"\",\"\",'BİLGİ GİRİŞİ'!AR73)","v":""},null,null,null,{"$f":"IF('BİLGİ GİRİŞİ'!AV73=\"\",\"\",'BİLGİ GİRİŞİ'!AV73)","v":""}]
[{"$f":"IF('BİLGİ GİRİŞİ'!D47=\"\",\"\",'BİLGİ GİRİŞİ'!D47)","v":""},{"$f":"IF('BİLGİ GİRİŞİ'!E47=\"\",\"\",'BİLGİ GİRİŞİ'!E47)","v":""},null,null,null,null,null,null,null,null,null,null,null,null,null,{"$f":"IF('BİLGİ GİRİŞİ'!W47=\"\",\"\",'BİLGİ GİRİŞİ'!W47)","v":""},null,null,null,{"$f":"IF('BİLGİ GİRİŞİ'!T47=\"\",\"\",'BİLGİ GİRİŞİ'!T47)","v":""},null,null,null,{"$f":"IF('BİLGİ GİRİŞİ'!AB74=\"\",\"\",'BİLGİ GİRİŞİ'!AB74)","v":""},null,null,null,{"$f":"IF('BİLGİ GİRİŞİ'!AF74=\"\",\"\",'BİLGİ GİRİŞİ'!AF74)","v":""},null,null,null,{"$f":"IF('BİLGİ GİRİŞİ'!AJ74=\"\",\"\",'BİLGİ GİRİŞİ'!AJ74)","v":""},null,null,null,{"$f":"IF('BİLGİ GİRİŞİ'!AN74=\"\",\"\",'BİLGİ GİRİŞİ'!AN74)","v":""},null,null,null,{"$f":"IF('BİLGİ GİRİŞİ'!AR74=\"\",\"\",'BİLGİ GİRİŞİ'!AR74)","v":""},null,null,null,{"$f":"IF('BİLGİ GİRİŞİ'!AV74=\"\",\"\",'BİLGİ GİRİŞİ'!AV74)","v":""}]
[{"$f":"IF('BİLGİ GİRİŞİ'!D48=\"\",\"\",'BİLGİ GİRİŞİ'!D48)","v":""},{"$f":"IF('BİLGİ GİRİŞİ'!E48=\"\",\"\",'BİLGİ GİRİŞİ'!E48)","v":""},null,null,null,null,null,null,null,null,null,null,null,null,null,{"$f":"IF('BİLGİ GİRİŞİ'!W48=\"\",\"\",'BİLGİ GİRİŞİ'!W48)","v":""},null,null,null,{"$f":"IF('BİLGİ GİRİŞİ'!T48=\"\",\"\",'BİLGİ GİRİŞİ'!T48)","v":""},null,null,null,{"$f":"IF('BİLGİ GİRİŞİ'!AB75=\"\",\"\",'BİLGİ GİRİŞİ'!AB75)","v":""},null,null,null,{"$f":"IF('BİLGİ GİRİŞİ'!AF75=\"\",\"\",'BİLGİ GİRİŞİ'!AF75)","v":""},null,null,null,{"$f":"IF('BİLGİ GİRİŞİ'!AJ75=\"\",\"\",'BİLGİ GİRİŞİ'!AJ75)","v":""},null,null,null,{"$f":"IF('BİLGİ GİRİŞİ'!AN75=\"\",\"\",'BİLGİ GİRİŞİ'!AN75)","v":""},null,null,null,{"$f":"IF('BİLGİ GİRİŞİ'!AR75=\"\",\"\",'BİLGİ GİRİŞİ'!AR75)","v":""},null,null,null,{"$f":"IF('BİLGİ GİRİŞİ'!AV75=\"\",\"\",'BİLGİ GİRİŞİ'!AV75)","v":""}]
[{"$f":"IF('BİLGİ GİRİŞİ'!D49=\"\",\"\",'BİLGİ GİRİŞİ'!D49)","v":""},{"$f":"IF('BİLGİ GİRİŞİ'!E49=\"\",\"\",'BİLGİ GİRİŞİ'!E49)","v":""},null,null,null,null,null,null,null,null,null,null,null,null,null,{"$f":"IF('BİLGİ GİRİŞİ'!W49=\"\",\"\",'BİLGİ GİRİŞİ'!W49)","v":""},null,null,null,{"$f":"IF('BİLGİ GİRİŞİ'!T49=\"\",\"\",'BİLGİ GİRİŞİ'!T49)","v":""},null,null,null,{"$f":"IF('BİLGİ GİRİŞİ'!AB76=\"\",\"\",'BİLGİ GİRİŞİ'!AB76)","v":""},null,null,null,{"$f":"IF('BİLGİ GİRİŞİ'!AF76=\"\",\"\",'BİLGİ GİRİŞİ'!AF76)","v":""},null,null,null,{"$f":"IF('BİLGİ GİRİŞİ'!AJ76=\"\",\"\",'BİLGİ GİRİŞİ'!AJ76)","v":""},null,null,null,{"$f":"IF('BİLGİ GİRİŞİ'!AN76=\"\",\"\",'BİLGİ GİRİŞİ'!AN76)","v":""},null,null,null,{"$f":"IF('BİLGİ GİRİŞİ'!AR76=\"\",\"\",'BİLGİ GİRİŞİ'!AR76)","v":""},null,null,null,{"$f":"IF('BİLGİ GİRİŞİ'!AV76=\"\",\"\",'BİLGİ GİRİŞİ'!AV76)","v":""}]
["TOPLAM",null,null,null,null,null,null,null,null,null,null,null,null,null,null,null,null,null,null,null,null,null,null,{"$f":"SUM(X12:X31)","v":30000},null,null,null,{"$f":"SUM(AB12:AB31)","v":388000},null,null,null,{"$f":"SUM(AF12:AF31)","v":26000},null,null,null,{"$f":"SUM(AJ12:AJ31)","v":334000},null,null,null,{"$f":"SUM(AN12:AN31)","v":28000},null,null,null,{"$f":"SUM(AR12:AR31)","v":358000}]
[]
["EN UYGUN (DÜŞÜK) TEKLİFİ VEREN VE TEKLİFİ UYGUN GÖRÜLEN GERÇEK/TÜZEL KİŞİ"]
["ADI",null,null,null,null,null,null,null,null,null,null,null,null,null,null,null,null,null,null,null,null,null,null,"GERÇEK/TÜZEL KİŞİ'NİN ADRESİ",null,null,null,null,null,null,null,null,null,null,null,null,null,null,null,"TEKLİF ETTİĞİ FİYAT"]
[{"$f":"IF('BİLGİ GİRİŞİ'!D81=\"\",\"\",'BİLGİ GİRİŞİ'!D81)","v":"B GERÇEK/TÜZEL KİŞİSİ"},null,null,null,null,null,null,null,null,null,null,null,null,null,null,null,null,null,null,null,null,null,null,{"$f":"IF('BİLGİ GİRİŞİ'!T81=\"\",\"\",'BİLGİ GİRİŞİ'!T81)","v":"Bulanık/MUŞ"},null,null,null,null,null,null,null,null,null,null,null,null,null,null,null,{"$f":"IF('BİLGİ GİRİŞİ'!AF81=\"\",\"\",'BİLGİ GİRİŞİ'!AF81)","v":334000}]
[]
[{"$f":"CONCATENATE(\"        Kamu İhale Kanunu'nun \",IF('BİLGİ GİRİŞİ'!O10=\"\",\".............................................................................\",'BİLGİ GİRİŞİ'!O10),\" maddesine göre Doğrudan Temin yoluyla satın alınacak Mal/Hizmet/Yapım İşi'ne ilişkin yapılan piyasa araştırması sonucu gerçek/tüzel kişilerce teklif edilen fiyatlar\"&\" tarafımızca  değerlendirilmiş olup Mal'ın/Hizmet'in/Yapım İşi'nin yukarıda bilgileri verilen ve teklifi uygun görülen gerçek/tüzel kişiden alınması uygun görülmüştür. \"& TEXT(IF('BİLGİ GİRİŞİ'!O22=\"\",\"…../…../……..\",'BİLGİ GİRİŞİ'!O22),\"gg.aa.yyyy \"))","v":"        Kamu İhale Kanunu'nun 22/d maddesine göre Doğrudan Temin yoluyla satın alınacak Mal/Hizmet/Yapım İşi'ne ilişkin yapılan piyasa araştırması sonucu gerçek/tüzel kişilerce teklif edilen fiyatlar tarafımızca  değerlendirilmiş olup Mal'ın/Hizmet'in/Yapım İşi'nin yukarıda bilgileri verilen ve teklifi uygun görülen gerçek/tüzel kişiden alınması uygun görülmüştür. 08.03.2023 "}]
[]
[]
[]
[null,null,null,null,null,null,null,null,null,null,null,null,null,null,null,null,null,null,null,null,null,null,null,null,null,null,null,null,null,null,null,{"$f":"IF(AF46=\"\",\"\",IF('BİLGİ GİRİŞİ'!AB16=\"\",\"\",'BİLGİ GİRİŞİ'!AB16))","v":"Piyasa Araştırma Görevlisi"}]
[{"$f":"IF(A46=\"\",\"\",IF('BİLGİ GİRİŞİ'!AH16=\"\",\"\",'BİLGİ GİRİŞİ'!AH16))","v":"Piyasa Araştırma Görevlisi"},null,null,null,null,null,null,null,null,null,null,null,null,null,null,{"$f":"IF(P46=\"\",\"\",IF('BİLGİ GİRİŞİ'!AN16=\"\",\"\",'BİLGİ GİRİŞİ'!AN16))","v":""}]
[]
[]
[{"$f":"IF('BİLGİ GİRİŞİ'!AH17=\"\",\"\",'BİLGİ GİRİŞİ'!AH17)","v":"Ayşe YILDIZ"},null,null,null,null,null,null,null,null,null,null,null,null,null,null,{"$f":"IF('BİLGİ GİRİŞİ'!AN17=\"\",\"\",'BİLGİ GİRİŞİ'!AN17)","v":""},null,null,null,null,null,null,null,null,null,null,null,null,null,null,null,{"$f":"IF('BİLGİ GİRİŞİ'!AB17=\"\",\"\",'BİLGİ GİRİŞİ'!AB17)","v":"Ahmet DEMİR"}]
[{"$f":"IF('BİLGİ GİRİŞİ'!AH18=\"\",\"\",'BİLGİ GİRİŞİ'!AH18)","v":"Öğretmen 1"},null,null,null,null,null,null,null,null,null,null,null,null,null,null,{"$f":"IF(P46=\"\",\"\",IF('BİLGİ GİRİŞİ'!AN18=\"\",\"\",'BİLGİ GİRİŞİ'!AN18))","v":""},null,null,null,null,null,null,null,null,null,null,null,null,null,null,null,{"$f":"IF('BİLGİ GİRİŞİ'!AB18=\"\",\"\",'BİLGİ GİRİŞİ'!AB18)","v":"Müdür Yardımcısı 1"}]

{"sheet":"8","index":9,"n_rows":58,"n_cols":28,"rows_kept":58,"cut":false,"hidden":false,"merged":[[36,1,36,22],[36,23,36,30],[35,0,35,30],[37,1,37,22],[37,23,37,30],[32,1,32,22],[32,23,32,30],[33,1,33,22],[33,23,33,30],[30,1,30,22],[30,23,30,30],[31,1,31,22],[31,23,31,30],[7,0,7,30],[8,1,8,22],[8,23,8,26],[8,27,8,30],[5,0,6,30],[9,1,9,22],[9,27,9,30],[9,23,9,26],[10,1,10,22],[10,27,10,30],[10,23,10,26],[11,1,11,22],[11,27,11,30],[11,23,11,26],[12,1,12,22],[12,23,12,26],[12,27,12,30],[13,1,13,22],[13,23,13,26],[13,27,13,30],[1,0,1,9],[3,0,3,9],[4,0,4,9],[1,11,1,30],[3,11,3,30],[4,11,4,14],[4,16,4,30],[2,0,2,9],[2,11,2,30],[14,1,14,22],[14,23,14,26],[14,27,14,30],[15,1,15,22],[15,23,15,26],[15,27,15,30],[16,1,16,22],[16,23,16,26],[16,27,16,30],[17,1,17,22],[17,23,17,26],[17,27,17,30],[18,1,18,22],[18,23,18,26],[18,27,18,30],[19,1,19,22],[19,23,19,26],[19,27,19,30],[20,1,20,22],[20,23,20,26],[20,27,20,30],[21,1,21,22],[21,23,21,26],[21,27,21,30],[22,1,22,22],[22,23,22,26],[22,27,22,30],[23,1,23,22],[23,23,23,26],[23,27,23,30],[24,1,24,22],[24,23,24,26],[24,27,24,30],[25,1,25,22],[25,23,25,26],[25,27,25,30],[26,1,26,22],[26,23,26,26],[26,27,26,30],[27,1,27,22],[27,23,27,26],[27,27,27,30],[28,1,28,22],[28,23,28,26],[28,27,28,30],[39,0,42,30],[44,0,44,9],[47,0,47,9],[44,10,44,19],[47,10,47,19],[44,20,44,30],[47,20,47,30],[45,0,45,9],[45,10,45,19],[45,20,45,30],[52,0,52,30],[54,0,54,30],[55,0,55,30],[48,0,48,9],[49,10,49,20],[49,21,49,30],[51,0,51,30],[48,10,48,19],[48,20,48,30]]}
[]
["İdarenin Adı",null,null,null,null,null,null,null,null,null,":",{"$f":"IF('BİLGİ GİRİŞİ'!O8=\"\",\"\",'BİLGİ GİRİŞİ'!O8)","v":"Atatürk İlkokulu Müdürlüğü"}]
["Doğrudan Temin Numarası",null,null,null,null,null,null,null,null,null,":",{"$f":"IF('BİLGİ GİRİŞİ'!O11=\"\",\"\",'BİLGİ GİRİŞİ'!O11)","v":"22DT1211930"}]
["Mal/Hizmet/Yapım Adı, Niteliği ",null,null,null,null,null,null,null,null,null,":",{"$f":"IF('BİLGİ GİRİŞİ'!O9=\"\",\"\",'BİLGİ GİRİŞİ'!O9)","v":"Bilişim Malzemeleri Alımı"}]
["Alım/Görevlendirme Onay Tarihi/sayısı",null,null,null,null,null,null,null,null,null,":",{"$f":"IF('BİLGİ GİRİŞİ'!O15=\"\",\"\",'BİLGİ GİRİŞİ'!O15)","v":"2023-03-06"},null,null,null,"/",{"$f":"IF('BİLGİ GİRİŞİ'!S15=\"\",\"\",'BİLGİ GİRİŞİ'!S15)","v":456789123}]
["MUAYENE VE KABUL TUTANAĞI\n(DOĞRUDAN TEMİN SONUÇ ONAY BELGESİ)"]
[]
["MAL'IN/HİZMET'İN/YAPIM İŞİ'NİN"]
["S","Kalem/KısımBilgileri",null,null,null,null,null,null,null,null,null,null,null,null,null,null,null,null,null,null,null,null,null,"Birimi",null,null,null,"Miktarı"]
[{"$f":"IF('BİLGİ GİRİŞİ'!D30=\"\",\"\",'BİLGİ GİRİŞİ'!D30)","v":1},{"$f":"IF('BİLGİ GİRİŞİ'!E30=\"\",\"\",'BİLGİ GİRİŞİ'!E30)","v":"AIO (All In One) Masaüstü Bilgisayar "},null,null,null,null,null,null,null,null,null,null,null,null,null,null,null,null,null,null,null,null,null,{"$f":"IF('BİLGİ GİRİŞİ'!W30=\"\",\"\",'BİLGİ GİRİŞİ'!W30)","v":"Adet"},null,null,null,{"$f":"IF('BİLGİ GİRİŞİ'!T30=\"\",\"\",'BİLGİ GİRİŞİ'!T30)","v":20}]
[{"$f":"IF('BİLGİ GİRİŞİ'!D31=\"\",\"\",'BİLGİ GİRİŞİ'!D31)","v":2},{"$f":"IF('BİLGİ GİRİŞİ'!E31=\"\",\"\",'BİLGİ GİRİŞİ'!E31)","v":"Fotokopi Makinesi"},null,null,null,null,null,null,null,null,null,null,null,null,null,null,null,null,null,null,null,null,null,{"$f":"IF('BİLGİ GİRİŞİ'!W31=\"\",\"\",'BİLGİ GİRİŞİ'!W31)","v":"Adet"},null,null,null,{"$f":"IF('BİLGİ GİRİŞİ'!T31=\"\",\"\",'BİLGİ GİRİŞİ'!T31)","v":10}]
[{"$f":"IF('BİLGİ GİRİŞİ'!D32=\"\",\"\",'BİLGİ GİRİŞİ'!D32)","v":3},{"$f":"IF('BİLGİ GİRİŞİ'!E32=\"\",\"\",'BİLGİ GİRİŞİ'!E32)","v":"Projektör"},null,null,null,null,null,null,null,null,null,null,null,null,null,null,null,null,null,null,null,null,null,{"$f":"IF('BİLGİ GİRİŞİ'!W32=\"\",\"\",'BİLGİ GİRİŞİ'!W32)","v":"Adet"},null,null,null,{"$f":"IF('BİLGİ GİRİŞİ'!T32=\"\",\"\",'BİLGİ GİRİŞİ'!T32)","v":4}]
[{"$f":"IF('BİLGİ GİRİŞİ'!D33=\"\",\"\",'BİLGİ GİRİŞİ'!D33)","v":""},{"$f":"IF('BİLGİ GİRİŞİ'!E33=\"\",\"\",'BİLGİ GİRİŞİ'!E33)","v":""},null,null,null,null,null,null,null,null,null,null,null,null,null,null,null,null,null,null,null,null,null,{"$f":"IF('BİLGİ GİRİŞİ'!W33=\"\",\"\",'BİLGİ GİRİŞİ'!W33)","v":""},null,null,null,{"$f":"IF('BİLGİ GİRİŞİ'!T33=\"\",\"\",'BİLGİ GİRİŞİ'!T33)","v":""}]
[{"$f":"IF('BİLGİ GİRİŞİ'!D34=\"\",\"\",'BİLGİ GİRİŞİ'!D34)","v":""},{"$f":"IF('BİLGİ GİRİŞİ'!E34=\"\",\"\",'BİLGİ GİRİŞİ'!E34)","v":""},null,null,null,null,null,null,null,null,null,null,null,null,null,null,null,null,null,null,null,null,null,{"$f":"IF('BİLGİ GİRİŞİ'!W34=\"\",\"\",'BİLGİ GİRİŞİ'!W34)","v":""},null,null,null,{"$f":"IF('BİLGİ GİRİŞİ'!T34=\"\",\"\",'BİLGİ GİRİŞİ'!T34)","v":""}]
[{"$f":"IF('BİLGİ GİRİŞİ'!D35=\"\",\"\",'BİLGİ GİRİŞİ'!D35)","v":""},{"$f":"IF('BİLGİ GİRİŞİ'!E35=\"\",\"\",'BİLGİ GİRİŞİ'!E35)","v":""},null,null,null,null,null,null,null,null,null,null,null,null,null,null,null,null,null,null,null,null,null,{"$f":"IF('BİLGİ GİRİŞİ'!W35=\"\",\"\",'BİLGİ GİRİŞİ'!W35)","v":""},null,null,null,{"$f":"IF('BİLGİ GİRİŞİ'!T35=\"\",\"\",'BİLGİ GİRİŞİ'!T35)","v":""}]
[{"$f":"IF('BİLGİ GİRİŞİ'!D36=\"\",\"\",'BİLGİ GİRİŞİ'!D36)","v":""},{"$f":"IF('BİLGİ GİRİŞİ'!E36=\"\",\"\",'BİLGİ GİRİŞİ'!E36)","v":""},null,null,null,null,null,null,null,null,null,null,null,null,null,null,null,null,null,null,null,null,null,{"$f":"IF('BİLGİ GİRİŞİ'!W36=\"\",\"\",'BİLGİ GİRİŞİ'!W36)","v":""},null,null,null,{"$f":"IF('BİLGİ GİRİŞİ'!T36=\"\",\"\",'BİLGİ GİRİŞİ'!T36)","v":""}]
[{"$f":"IF('BİLGİ GİRİŞİ'!D37=\"\",\"\",'BİLGİ GİRİŞİ'!D37)","v":""},{"$f":"IF('BİLGİ GİRİŞİ'!E37=\"\",\"\",'BİLGİ GİRİŞİ'!E37)","v":""},null,null,null,null,null,null,null,null,null,null,null,null,null,null,null,null,null,null,null,null,null,{"$f":"IF('BİLGİ GİRİŞİ'!W37=\"\",\"\",'BİLGİ GİRİŞİ'!W37)","v":""},null,null,null,{"$f":"IF('BİLGİ GİRİŞİ'!T37=\"\",\"\",'BİLGİ GİRİŞİ'!T37)","v":""}]
[{"$f":"IF('BİLGİ GİRİŞİ'!D38=\"\",\"\",'BİLGİ GİRİŞİ'!D38)","v":""},{"$f":"IF('BİLGİ GİRİŞİ'!E38=\"\",\"\",'BİLGİ GİRİŞİ'!E38)","v":""},null,null,null,null,null,null,null,null,null,null,null,null,null,null,null,null,null,null,null,null,null,{"$f":"IF('BİLGİ GİRİŞİ'!W38=\"\",\"\",'BİLGİ GİRİŞİ'!W38)","v":""},null,null,null,{"$f":"IF('BİLGİ GİRİŞİ'!T38=\"\",\"\",'BİLGİ GİRİŞİ'!T38)","v":""}]
[{"$f":"IF('BİLGİ GİRİŞİ'!D39=\"\",\"\",'BİLGİ GİRİŞİ'!D39)","v":""},{"$f":"IF('BİLGİ GİRİŞİ'!E39=\"\",\"\",'BİLGİ GİRİŞİ'!E39)","v":""},null,null,null,null,null,null,null,null,null,null,null,null,null,null,null,null,null,null,null,null,null,{"$f":"IF('BİLGİ GİRİŞİ'!W39=\"\",\"\",'BİLGİ GİRİŞİ'!W39)","v":""},null,null,null,{"$f":"IF('BİLGİ GİRİŞİ'!T39=\"\",\"\",'BİLGİ GİRİŞİ'!T39)","v":""}]
[{"$f":"IF('BİLGİ GİRİŞİ'!D40=\"\",\"\",'BİLGİ GİRİŞİ'!D40)","v":""},{"$f":"IF('BİLGİ GİRİŞİ'!E40=\"\",\"\",'BİLGİ GİRİŞİ'!E40)","v":""},null,null,null,null,null,null,null,null,null,null,null,null,null,null,null,null,null,null,null,null,null,{"$f":"IF('BİLGİ GİRİŞİ'!W40=\"\",\"\",'BİLGİ GİRİŞİ'!W40)","v":""},null,null,null,{"$f":"IF('BİLGİ GİRİŞİ'!T40=\"\",\"\",'BİLGİ GİRİŞİ'!T40)","v":""}]
[{"$f":"IF('BİLGİ GİRİŞİ'!D41=\"\",\"\",'BİLGİ GİRİŞİ'!D41)","v":""},{"$f":"IF('BİLGİ GİRİŞİ'!E41=\"\",\"\",'BİLGİ GİRİŞİ'!E41)","v":""},null,null,null,null,null,null,null,null,null,null,null,null,null,null,null,null,null,null,null,null,null,{"$f":"IF('BİLGİ GİRİŞİ'!W41=\"\",\"\",'BİLGİ GİRİŞİ'!W41)","v":""},null,null,null,{"$f":"IF('BİLGİ GİRİŞİ'!T41=\"\",\"\",'BİLGİ GİRİŞİ'!T41)","v":""}]
[{"$f":"IF('BİLGİ GİRİŞİ'!D42=\"\",\"\",'BİLGİ GİRİŞİ'!D42)","v":""},{"$f":"IF('BİLGİ GİRİŞİ'!E42=\"\",\"\",'BİLGİ GİRİŞİ'!E42)","v":""},null,null,null,null,null,null,null,null,null,null,null,null,null,null,null,null,null,null,null,null,null,{"$f":"IF('BİLGİ GİRİŞİ'!W42=\"\",\"\",'BİLGİ GİRİŞİ'!W42)","v":""},null,null,null,{"$f":"IF('BİLGİ GİRİŞİ'!T42=\"\",\"\",'BİLGİ GİRİŞİ'!T42)","v":""}]
[{"$f":"IF('BİLGİ GİRİŞİ'!D43=\"\",\"\",'BİLGİ GİRİŞİ'!D43)","v":""},{"$f":"IF('BİLGİ GİRİŞİ'!E43=\"\",\"\",'BİLGİ GİRİŞİ'!E43)","v":""},null,null,null,null,null,null,null,null,null,null,null,null,null,null,null,null,null,null,null,null,null,{"$f":"IF('BİLGİ GİRİŞİ'!W43=\"\",\"\",'BİLGİ GİRİŞİ'!W43)","v":""},null,null,null,{"$f":"IF('BİLGİ GİRİŞİ'!T43=\"\",\"\",'BİLGİ GİRİŞİ'!T43)","v":""}]
[{"$f":"IF('BİLGİ GİRİŞİ'!D44=\"\",\"\",'BİLGİ GİRİŞİ'!D44)","v":""},{"$f":"IF('BİLGİ GİRİŞİ'!E44=\"\",\"\",'BİLGİ GİRİŞİ'!E44)","v":""},null,null,null,null,null,null,null,null,null,null,null,null,null,null,null,null,null,null,null,null,null,{"$f":"IF('BİLGİ GİRİŞİ'!W44=\"\",\"\",'BİLGİ GİRİŞİ'!W44)","v":""},null,null,null,{"$f":"IF('BİLGİ GİRİŞİ'!T44=\"\",\"\",'BİLGİ GİRİŞİ'!T44)","v":""}]
[{"$f":"IF('BİLGİ GİRİŞİ'!D45=\"\",\"\",'BİLGİ GİRİŞİ'!D45)","v":""},{"$f":"IF('BİLGİ GİRİŞİ'!E45=\"\",\"\",'BİLGİ GİRİŞİ'!E45)","v":""},null,null,null,null,null,null,null,null,null,null,null,null,null,null,null,null,null,null,null,null,null,{"$f":"IF('BİLGİ GİRİŞİ'!W45=\"\",\"\",'BİLGİ GİRİŞİ'!W45)","v":""},null,null,null,{"$f":"IF('BİLGİ GİRİŞİ'!T45=\"\",\"\",'BİLGİ GİRİŞİ'!T45)","v":""}]
[{"$f":"IF('BİLGİ GİRİŞİ'!D46=\"\",\"\",'BİLGİ GİRİŞİ'!D46)","v":""},{"$f":"IF('BİLGİ GİRİŞİ'!E46=\"\",\"\",'BİLGİ GİRİŞİ'!E46)","v":""},null,null,null,null,null,null,null,null,null,null,null,null,null,null,null,null,null,null,null,null,null,{"$f":"IF('BİLGİ GİRİŞİ'!W46=\"\",\"\",'BİLGİ GİRİŞİ'!W46)","v":""},null,null,null,{"$f":"IF('BİLGİ GİRİŞİ'!T46=\"\",\"\",'BİLGİ GİRİŞİ'!T46)","v":""}]
[{"$f":"IF('BİLGİ GİRİŞİ'!D47=\"\",\"\",'BİLGİ GİRİŞİ'!D47)","v":""},{"$f":"IF('BİLGİ GİRİŞİ'!E47=\"\",\"\",'BİLGİ GİRİŞİ'!E47)","v":""},null,null,null,null,null,null,null,null,null,null,null,null,null,null,null,null,null,null,null,null,null,{"$f":"IF('BİLGİ GİRİŞİ'!W47=\"\",\"\",'BİLGİ GİRİŞİ'!W47)","v":""},null,null,null,{"$f":"IF('BİLGİ GİRİŞİ'!T47=\"\",\"\",'BİLGİ GİRİŞİ'!T47)","v":""}]
[{"$f":"IF('BİLGİ GİRİŞİ'!D48=\"\",\"\",'BİLGİ GİRİŞİ'!D48)","v":""},{"$f":"IF('BİLGİ GİRİŞİ'!E48=\"\",\"\",'BİLGİ GİRİŞİ'!E48)","v":""},null,null,null,null,null,null,null,null,null,null,null,null,null,null,null,null,null,null,null,null,null,{"$f":"IF('BİLGİ GİRİŞİ'!W48=\"\",\"\",'BİLGİ GİRİŞİ'!W48)","v":""},null,null,null,{"$f":"IF('BİLGİ GİRİŞİ'!T48=\"\",\"\",'BİLGİ GİRİŞİ'!T48)","v":""}]
[{"$f":"IF('BİLGİ GİRİŞİ'!D49=\"\",\"\",'BİLGİ GİRİŞİ'!D49)","v":""},{"$f":"IF('BİLGİ GİRİŞİ'!E49=\"\",\"\",'BİLGİ GİRİŞİ'!E49)","v":""},null,null,null,null,null,null,null,null,null,null,null,null,null,null,null,null,null,null,null,null,null,{"$f":"IF('BİLGİ GİRİŞİ'!W49=\"\",\"\",'BİLGİ GİRİŞİ'!W49)","v":""},null,null,null,{"$f":"IF('BİLGİ GİRİŞİ'!T49=\"\",\"\",'BİLGİ GİRİŞİ'!T49)","v":""}]
[]
["S","TEKLİF VEREN GERÇEK/TÜZEL KİŞİLER",null,null,null,null,null,null,null,null,null,null,null,null,null,null,null,null,null,null,null,null,null,"TEKLİF FİYATLARI"]
[1,{"$f":"IF('BİLGİ GİRİŞİ'!AB55=\"\",\"\",'BİLGİ GİRİŞİ'!AB55)","v":"A GERÇEK/TÜZEL KİŞİSİ"},null,null,null,null,null,null,null,null,null,null,null,null,null,null,null,null,null,null,null,null,null,{"$f":"IF('BİLGİ GİRİŞİ'!AF77=\"\",\"\",'BİLGİ GİRİŞİ'!AF77)","v":388000}]
[2,{"$f":"IF('BİLGİ GİRİŞİ'!AJ55=\"\",\"\",'BİLGİ GİRİŞİ'!AJ55)","v":"B GERÇEK/TÜZEL KİŞİSİ"},null,null,null,null,null,null,null,null,null,null,null,null,null,null,null,null,null,null,null,null,null,{"$f":"IF('BİLGİ GİRİŞİ'!AN77=\"\",\"\",'BİLGİ GİRİŞİ'!AN77)","v":334000}]
[3,{"$f":"IF('BİLGİ GİRİŞİ'!AR55=\"\",\"\",'BİLGİ GİRİŞİ'!AR55)","v":"D GERÇEK/TÜZEL KİŞİSİ"},null,null,null,null,null,null,null,null,null,null,null,null,null,null,null,null,null,null,null,null,null,{"$f":"IF('BİLGİ GİRİŞİ'!AV77=\"\",\"\",'BİLGİ GİRİŞİ'!AV77)","v":358000}]
[]
["EN UYGUN (DÜŞÜK) TEKLİFİ VEREN VE TEKLİFİ UYGUN GÖRÜLEN GERÇEK/TÜZEL KİŞİ"]
["S","Adı",null,null,null,null,null,null,null,null,null,null,null,null,null,null,null,null,null,null,null,null,null,"Teklif Fiyatı"]
[1,{"$f":"IF('BİLGİ GİRİŞİ'!D81=\"\",\"\",'BİLGİ GİRİŞİ'!D81)","v":"B GERÇEK/TÜZEL KİŞİSİ"},null,null,null,null,null,null,null,null,null,null,null,null,null,null,null,null,null,null,null,null,null,{"$f":"IF('BİLGİ GİRİŞİ'!AF81=\"\",\"\",'BİLGİ GİRİŞİ'!AF81)","v":334000}]
[]
["       Yukarıda bilgileri verilen Mal/Hizmet/Yapım İşi, idarenin belirlediği şartlar dahilinde muayenesi yapılmış olup kabule engel herhangi bir durum tespit edilmemiştir. Söz konusu işin yukarıda alım yapılması uygun görülen gerçek/tüzel kişiden Doğrudan Temin yoluyla satın alınması hususunu;\n       Olurlarınıza arz ederim/ederiz."]
[]
[]
[]
[]
[{"$f":"IF(A48=\"\",\"\",IF('BİLGİ GİRİŞİ'!AH21=\"\",\"\",'BİLGİ GİRİŞİ'!AH21))","v":"Muayene ve Kabul Görevlisi"},null,null,null,null,null,null,null,null,null,{"$f":"IF(K48=\"\",\"\",IF('BİLGİ GİRİŞİ'!AN21=\"\",\"\",'BİLGİ GİRİŞİ'!AN21))","v":""},null,null,null,null,null,null,null,null,null,{"$f":"IF(U48=\"\",\"\",IF('BİLGİ GİRİŞİ'!AB21=\"\",\"\",'BİLGİ GİRİŞİ'!AB21))","v":"Muayene ve Kabul Görevlisi"}]
[{"$f":"IF(A48=\"\",\"\",IF('BİLGİ GİRİŞİ'!O23=\"\",\"…../…../……..\",'BİLGİ GİRİŞİ'!O23))","v":"2023-03-08"},null,null,null,null,null,null,null,null,null,{"$f":"IF(K48=\"\",\"\",IF('BİLGİ GİRİŞİ'!O23=\"\",\"…../…../……..\",'BİLGİ GİRİŞİ'!O23))","v":""},null,null,null,null,null,null,null,null,null,{"$f":"IF(U48=\"\",\"\",IF('BİLGİ GİRİŞİ'!O23=\"\",\"…../…../……..\",'BİLGİ GİRİŞİ'!O23))","v":"2023-03-08"}]
[]
[{"$f":"IF('BİLGİ GİRİŞİ'!AH22=\"\",\"\",'BİLGİ GİRİŞİ'!AH22)","v":"Fatma GÜNEŞ"},null,null,null,null,null,null,null,null,null,{"$f":"IF('BİLGİ GİRİŞİ'!AN22=\"\",\"\",'BİLGİ GİRİŞİ'!AN22)","v":""},null,null,null,null,null,null,null,null,null,{"$f":"IF('BİLGİ GİRİŞİ'!AB22=\"\",\"\",'BİLGİ GİRİŞİ'!AB22)","v":"Mehmet  ÇELİK"}]
[{"$f":"IF('BİLGİ GİRİŞİ'!AH23=\"\",\"\",'BİLGİ GİRİŞİ'!AH23)","v":"Öğretmen 2"},null,null,null,null,null,null,null,null,null,{"$f":"IF(K48=\"\",\"\",IF('BİLGİ GİRİŞİ'!AN23=\"\",\"\",'BİLGİ GİRİŞİ'!AN23))","v":""},null,null,null,null,null,null,null,null,null,{"$f":"IF('BİLGİ GİRİŞİ'!AB23=\"\",\"\",'BİLGİ GİRİŞİ'!AB23)","v":"Müdür Yardımcısı 2"}]
[]
[]
[{"$f":"IF(A55=\"\",\"\",IF('BİLGİ GİRİŞİ'!AT21=\"\",\"\",'BİLGİ GİRİŞİ'!AT21))","v":"OLUR/UYGUNDUR"}]
[{"$f":"IF(A55=\"\",\"\",IF('BİLGİ GİRİŞİ'!O23=\"\",\"…../…../……..\",'BİLGİ GİRİŞİ'!O23))","v":"2023-03-08"}]
[]
[{"$f":"IF('BİLGİ GİRİŞİ'!AT22=\"\",\"\",'BİLGİ GİRİŞİ'!AT22)","v":"Mustafa AYDIN"}]
[{"$f":"IF(A55=\"\",\"\",'BİLGİ GİRİŞİ'!AT23)","v":"Okul Müdürü"}]
[]
["Ek: Piyasa Fiyat Araştırma Tutanağı"]

{"sheet":"KAPAK","index":10,"n_rows":42,"n_cols":28,"rows_kept":42,"cut":false,"hidden":false,"merged":[[1,0,1,9],[1,11,1,30],[2,0,2,9],[2,11,2,14],[2,16,2,30],[14,0,14,30],[15,27,15,30],[3,0,3,30],[4,0,4,30],[24,27,24,30],[13,0,13,30],[16,1,16,26],[16,27,16,30],[17,1,17,26],[17,27,17,30],[5,0,5,30],[10,0,10,30],[9,0,9,30],[15,1,15,26],[25,27,25,30],[24,1,24,26],[25,1,25,26],[18,1,18,26],[18,27,18,30],[22,27,22,30],[23,27,23,30],[23,1,23,26],[19,1,19,26],[19,27,19,30],[22,1,22,26],[20,1,20,26],[20,27,20,30],[21,1,21,26],[21,27,21,30],[27,27,27,30],[27,1,27,26],[32,0,32,26],[32,27,32,30],[26,27,26,30],[26,1,26,26],[30,27,30,30],[31,27,31,30],[30,1,30,26],[31,1,31,26],[28,27,28,30],[29,27,29,30],[28,1,28,26],[29,1,29,26],[35,10,35,19],[35,20,35,30],[36,0,36,9],[36,10,36,19],[36,20,36,30],[35,0,35,2],[35,5,35,9],[38,0,38,9],[38,10,38,19],[38,20,38,30],[39,0,39,9],[39,10,39,19],[39,20,39,30],[40,10,40,20],[40,21,40,30],[42,0,42,30],[40,0,40,9],[41,0,41,9]]}
[]
[]
[]
["T.C."]
[{"$f":"IF('BİLGİ GİRİŞİ'!O7=\"\",\"\",'BİLGİ GİRİŞİ'!O7)","v":"BULANIK KAYMAKAMLIĞI"}]
[{"$f":"IF('BİLGİ GİRİŞİ'!O8=\"\",\"\",'BİLGİ GİRİŞİ'!O8)","v":"Atatürk İlkokulu Müdürlüğü"}]
[]
[]
[]
[{"$f":"IF('BİLGİ GİRİŞİ'!O11=\"\",\"\",CONCATENATE('BİLGİ GİRİŞİ'!O11,\" DOĞRUDAN TEMİN NUMARALI\"))","v":"22DT1211930 DOĞRUDAN TEMİN NUMARALI"}]
[{"$f":"UPPER(IF('BİLGİ GİRİŞİ'!O9=\"\",\"\",'BİLGİ GİRİŞİ'!O9))","v":"BİLİŞİM MALZEMELERİ ALIMI"}]
[]
[]
[]
["DOĞRUDAN TEMİN İŞLEM DOSYASI DİZİ PUSULASI"]
["S.N","Belge Adı",null,null,null,null,null,null,null,null,null,null,null,null,null,null,null,null,null,null,null,null,null,null,null,null,null,"Sayfa Sayısı"]
[1,"Ödeme Emri Belgesi",null,null,null,null,null,null,null,null,null,null,null,null,null,null,null,null,null,null,null,null,null,null,null,null,null,1]
[2,"Fatura",null,null,null,null,null,null,null,null,null,null,null,null,null,null,null,null,null,null,null,null,null,null,null,null,null,1]
[3,"Harcama Talimatı",null,null,null,null,null,null,null,null,null,null,null,null,null,null,null,null,null,null,null,null,null,null,null,null,null,1]
[4,"Taşınır İşlem Fişi",null,null,null,null,null,null,null,null,null,null,null,null,null,null,null,null,null,null,null,null,null,null,null,null,null,1]
[5,"Varlık İşlem Fişi",null,null,null,null,null,null,null,null,null,null,null,null,null,null,null,null,null,null,null,null,null,null,null,null,null,1]
[6,"Vergi Borcu Yok Belgesi (Yüklenici)",null,null,null,null,null,null,null,null,null,null,null,null,null,null,null,null,null,null,null,null,null,null,null,null,null,1]
[7,"Alım/Görevlendirme Onayı",null,null,null,null,null,null,null,null,null,null,null,null,null,null,null,null,null,null,null,null,null,null,null,null,null,1]
[8,"Yaklaşık Maliyet Araştırma (Piyasa Fiyatları) Belgeleri/Mektupları",null,null,null,null,null,null,null,null,null,null,null,null,null,null,null,null,null,null,null,null,null,null,null,null,null,3]
[9,"Doğrudan Temin Onay Belgesi ve Eki Yaklaşık Maliyet Hesap Cetveli",null,null,null,null,null,null,null,null,null,null,null,null,null,null,null,null,null,null,null,null,null,null,null,null,null,2]
[10,"Piyasa Fiyat Araştırma (Teklif Edilen Fiyalar) Belgeleri/Mektupları",null,null,null,null,null,null,null,null,null,null,null,null,null,null,null,null,null,null,null,null,null,null,null,null,null,3]
[11,"Muayene ve Kabul Tutanağı (Doğrudan Temin Sonuç Onay Belgesi) ve Eki Piyasa Fiyat Araştırma Tutanağı",null,null,null,null,null,null,null,null,null,null,null,null,null,null,null,null,null,null,null,null,null,null,null,null,null,2]
[]
[]
[]
[]
[]
["TOPLAM",null,null,null,null,null,null,null,null,null,null,null,null,null,null,null,null,null,null,null,null,null,null,null,null,null,null,{"$f":"SUM(AB17:AB27)","v":17}]
[]
[]
["İş Bu Dosya",null,null,{"$f":"(AB33)","v":17},null,"Sayfadan İbarettir."]
[]
[]
[]
[]
[{"$f":"IF('BİLGİ GİRİŞİ'!AT22=\"\",\"\",'BİLGİ GİRİŞİ'!AT22)","v":"Mustafa AYDIN"}]
[{"$f":"IF(A41=\"\",\"\",'BİLGİ GİRİŞİ'!AT23)","v":"Okul Müdürü"}]